program: Orca
programVersion: 4.2.1
elementType: Cl Cl O O N N N C C C C C C C C C C C C C C C H H H H H H H H H H H H H H H H H
charge: 0
multiplicity: 1
keywords: wb97x-d3
keywords: def2-TZVPP
keywords: def2/J RIJCOSX GRIDX6 NOFINALGRIDX
keywords: grid4 nofinalgrid
keywords: scfconv7
keywords: smallprint printgap noloewdin
keywords: NOSOSCF
formula: C15H17Cl2N3O2
InChI: InChI=1/C15H17Cl2N3O2/c1-2-3-12-7-21-15(22-12,8-20-10-18-9-19-20)13-5-4-11(16)6-14(13)17/h4-6,9-10,12H,2-3,7-8H2,1H3
39 atoms
Cl 1.203943 -0.035641 -2.441581
Cl 5.723375 -0.446361 0.348825
O  -0.956706 -0.542155 -0.497054
O  -0.757247 0.200181 1.611827
N  -1.972152 2.035691 -0.259864
N  -2.687001 2.466438 0.783117
N  -4.02353 2.047313 -0.965979
C  -0.270238 0.358522 0.309586
C  -1.606994 -1.515256 0.316867
C  -1.810499 -0.747066 1.61442
C  -2.858628 -1.982807 -0.401279
C  -0.557985 1.791059 -0.169205
C  1.236153 0.115009 0.294272
C  -3.588686 -3.145202 0.267378
C  1.963679 -0.052589 -0.883772
C  1.950997 0.105907 1.488388
C  -4.293784 -2.810231 1.574614
C  3.339356 -0.229894 -0.876077
C  3.324331 -0.066818 1.525155
C  -2.781926 1.780823 -1.291336
C  4.008491 -0.234651 0.334782
C  -3.908252 2.461648 0.312516
H  -0.934224 -2.368239 0.4815
H  -2.780747 -0.239521 1.648694
H  -1.714467 -1.372977 2.501845
H  -2.564502 -2.295042 -1.407183
H  -3.542936 -1.13619 -0.526115
H  -0.114878 1.973549 -1.146763
H  -0.122595 2.506383 0.527257
H  -2.892628 -3.974811 0.424889
H  -4.333555 -3.514096 -0.441715
H  1.428872 0.238782 2.424926
H  -3.600036 -2.585715 2.385726
H  -4.960409 -1.952967 1.460144
H  -4.902929 -3.651407 1.909098
H  3.876927 -0.359892 -1.805039
H  3.845355 -0.067247 2.472323
H  -2.426181 1.41727 -2.242699
H  -4.749174 2.774444 0.912214
elementType: Cl O N C H
totalener: -1817.04264008 hartree
nucrepener: 2166.79186957 hartree
electener: -3983.83450966 hartree
oneelecener: -6798.91325872 hartree
twoeener: 2815.07874906 hartree
cpcmener: -0.02212881 hartree
kineticenergy: 1811.89666909 hartree
xcener: -128.813517370200 hartree
chargesum: -0.0000000
charge: -0.074592 -0.082722 -0.371141 -0.394031 0.148043 -0.362149 -0.407355 0.565769 0.200985 -0.050792 -0.154361 -0.139268 -0.054506 -0.100560 -0.037931 -0.153488 -0.290446 -0.145366 -0.170715 0.046845 0.108958 0.063604 0.084224 0.088680 0.112076 0.081537 0.066795 0.146867 0.130965 0.059160 0.075522 0.149279 0.083987 0.086220 0.098161 0.122121 0.145383 0.163414 0.160828
qa: -0.0746 -0.0827 -0.3711 -0.3940 0.1480 -0.3621 -0.4074 0.5658 0.2010 -0.0508 -0.1544 -0.1393 -0.0545 -0.1006 -0.0379 -0.1535 -0.2904 -0.1454 -0.1707 0.0468 0.1090 0.0636 0.0842 0.0887 0.1121 0.0815 0.0668 0.1469 0.1310 0.0592 0.0755 0.1493 0.0840 0.0862 0.0982 0.1221 0.1454 0.1634 0.1608
va: 1.2438 1.2211 2.0092 1.9849 3.3388 2.8700 3.0013 3.8737 3.7696 3.9936 3.9606 3.8141 3.5919 3.9096 4.0156 3.9673 3.9278 4.0759 4.0371 4.0694 3.8652 4.0308 1.0041 0.9920 0.9994 1.0160 1.0155 1.0142 1.0233 1.0084 1.0037 1.0256 1.0003 1.0013 1.0048 1.0251 1.0068 1.0043 0.9957
dispcorr: -0.022366419 hartree
energy: -1817.065006503934
dipole: -37.79965 38.35420 0.55455 -13.19579 12.13569 -1.06010 11.80442 -11.39464 0.40978
magnitude: 1.26462 au
magnitude: 3.21440 debye
