program: Orca
programVersion: 4.2.1
elementType: Cl Cl O O N N N C C C C C C C C C C C C C C C H H H H H H H H H H H H H H H H H
charge: 0
multiplicity: 1
keywords: wb97x-d3
keywords: def2-TZVPP
keywords: def2/J RIJCOSX GRIDX6 NOFINALGRIDX
keywords: grid4 nofinalgrid
keywords: scfconv7
keywords: smallprint printgap noloewdin
keywords: NOSOSCF
formula: C15H17Cl2N3O2
InChI: InChI=1/C15H17Cl2N3O2/c1-2-3-12-7-21-15(22-12,8-20-10-18-9-19-20)13-5-4-11(16)6-14(13)17/h4-6,9-10,12H,2-3,7-8H2,1H3
39 atoms
Cl -0.198335 -1.256504 -2.063827
Cl 4.775486 0.131784 -0.744481
O  -1.696956 -1.12256 0.505136
O  -1.281976 0.518222 1.939787
N  -1.211338 2.263867 -0.668072
N  -0.872923 3.193052 0.225708
N  -0.04299 3.703601 -1.790815
C  -1.123664 0.138488 0.602156
C  -1.3826 -1.808187 1.70943
C  -1.302181 -0.664393 2.730333
C  -2.440925 -2.849016 1.998806
C  -1.936354 1.079689 -0.298669
C  0.361432 0.119306 0.233178
C  -2.559864 -3.916148 0.917047
C  0.852968 -0.488657 -0.920059
C  1.28468 0.755577 1.057422
C  -3.634362 -4.943713 1.236277
C  2.204899 -0.491857 -1.228682
C  2.63994 0.768725 0.775837
C  -0.702508 2.574403 -1.862592
C  3.088776 0.135467 -0.368656
C  -0.174767 4.035631 -0.491865
H  -0.40455 -2.296875 1.609388
H  -2.176055 -0.627492 3.385548
H  -0.408484 -0.738089 3.354565
H  -3.405502 -2.351366 2.145707
H  -2.187581 -3.320596 2.953629
H  -2.860172 1.355982 0.20907
H  -2.205113 0.563242 -1.217319
H  -1.59566 -4.418423 0.792394
H  -2.784455 -3.445624 -0.043065
H  0.94097 1.259664 1.949021
H  -3.429341 -5.462108 2.175157
H  -4.616551 -4.475422 1.327693
H  -3.705261 -5.700088 0.453306
H  2.558696 -0.975926 -2.128273
H  3.328342 1.268342 1.443098
H  -0.846766 1.96254 -2.739266
H  0.252096 4.929542 -0.065014
elementType: Cl O N C H
totalener: -1817.04380046 hartree
nucrepener: 2195.91016720 hartree
electener: -4012.95396766 hartree
oneelecener: -6857.47411484 hartree
twoeener: 2844.52014719 hartree
cpcmener: -0.02456462 hartree
kineticenergy: 1811.92808946 hartree
xcener: -128.816843283178 hartree
chargesum: 0.0000000
charge: -0.069784 -0.082491 -0.354297 -0.383105 0.132927 -0.351158 -0.402489 0.615750 0.154206 -0.007951 -0.170858 -0.148015 -0.106713 -0.055983 -0.072473 -0.161969 -0.286856 -0.110610 -0.165019 0.077290 0.099507 0.066664 0.084952 0.090402 0.096159 0.064910 0.078641 0.125849 0.137866 0.055053 0.059898 0.148374 0.078496 0.080700 0.091375 0.120692 0.146135 0.163961 0.159965
qa: -0.0698 -0.0825 -0.3543 -0.3831 0.1329 -0.3512 -0.4025 0.6157 0.1542 -0.0080 -0.1709 -0.1480 -0.1067 -0.0560 -0.0725 -0.1620 -0.2869 -0.1106 -0.1650 0.0773 0.0995 0.0667 0.0850 0.0904 0.0962 0.0649 0.0786 0.1258 0.1379 0.0551 0.0599 0.1484 0.0785 0.0807 0.0914 0.1207 0.1461 0.1640 0.1600
va: 1.2500 1.2216 2.0246 1.9769 3.3533 2.8778 3.0364 3.7391 3.8298 3.9707 3.9596 3.8834 3.5597 3.8377 4.0288 3.9141 3.9500 4.0485 4.0432 4.0440 3.8792 4.0419 1.0029 1.0028 0.9935 1.0165 1.0109 1.0251 1.0063 1.0110 1.0224 1.0303 1.0007 1.0001 1.0033 1.0238 1.0051 1.0021 0.9955
dispcorr: -0.022415296 hartree
energy: -1817.066215756909
dipole: -28.41097 27.67377 -0.73720 -19.11988 17.37541 -1.74447 18.54487 -17.49126 1.05361
magnitude: 2.16720 au
magnitude: 5.50858 debye
