program: Orca
programVersion: 4.2.1
elementType: Cl Cl O O N N N C C C C C C C C C C C C C C C H H H H H H H H H H H H H H H H H
charge: 0
multiplicity: 1
keywords: wb97x-d3
keywords: def2-TZVPP
keywords: def2/J RIJCOSX GRIDX6 NOFINALGRIDX
keywords: grid4 nofinalgrid
keywords: scfconv7
keywords: smallprint printgap noloewdin
keywords: NOSOSCF
formula: C15H17Cl2N3O2
InChI: InChI=1/C15H17Cl2N3O2/c1-2-3-12-7-21-15(22-12,8-20-10-18-9-19-20)13-5-4-11(16)6-14(13)17/h4-6,9-10,12H,2-3,7-8H2,1H3
39 atoms
Cl 0.674362 -1.311124 -2.305697
Cl 4.890889 0.838637 0.141474
O  -1.444228 -1.468734 -0.239611
O  -1.617005 0.118699 1.302917
N  -1.268908 2.114849 -0.877535
N  -0.283435 2.558742 -1.660486
N  -0.871231 4.127858 -0.176884
C  -1.075074 -0.157975 0.047362
C  -1.590661 -2.187441 0.983643
C  -1.530879 -1.083084 2.051441
C  -2.891863 -2.966708 0.955082
C  -1.745082 0.760345 -0.980593
C  0.442337 0.032342 0.06428
C  -3.036312 -3.90613 2.146261
C  1.283317 -0.433008 -0.943717
C  1.028506 0.769257 1.088989
C  -4.34103 -4.686601 2.112773
C  2.649259 -0.195021 -0.926299
C  2.388284 1.024549 1.132416
C  -1.605255 3.057376 0.007641
C  3.18979 0.534141 0.117807
C  -0.0805 3.768347 -1.207845
H  -0.748164 -2.878019 1.100656
H  -2.368618 -1.107442 2.749466
H  -0.603108 -1.128259 2.629506
H  -2.933487 -3.551241 0.03104
H  -3.733231 -2.265775 0.925508
H  -2.824396 0.739918 -0.827596
H  -1.541698 0.414678 -1.99136
H  -2.980346 -3.34068 3.081644
H  -2.193295 -4.603325 2.163129
H  0.41061 1.167077 1.881836
H  -4.416702 -5.296223 1.210238
H  -4.425439 -5.356643 2.969334
H  -5.205063 -4.019486 2.131855
H  3.278215 -0.57006 -1.721602
H  2.807143 1.600447 1.945833
H  -2.380334 2.924445 0.74594
H  0.663164 4.419853 -1.63988
elementType: Cl O N C H
totalener: -1817.04418702 hartree
nucrepener: 2175.87872862 hartree
electener: -3992.92291564 hartree
oneelecener: -6817.42951070 hartree
twoeener: 2824.50659506 hartree
cpcmener: -0.02379422 hartree
kineticenergy: 1811.91283476 hartree
xcener: -128.813957708027 hartree
chargesum: 0.0000000
charge: -0.074195 -0.083611 -0.372275 -0.379843 0.112165 -0.333342 -0.403882 0.577711 0.168437 -0.026837 -0.164624 -0.098574 -0.110983 -0.086646 -0.030802 -0.148936 -0.281233 -0.136243 -0.193171 0.059750 0.116775 0.059749 0.084789 0.104942 0.102517 0.073716 0.073541 0.130048 0.131435 0.060074 0.064077 0.155999 0.080693 0.091610 0.080109 0.120098 0.146008 0.170670 0.160286
qa: -0.0742 -0.0836 -0.3723 -0.3798 0.1122 -0.3333 -0.4039 0.5777 0.1684 -0.0268 -0.1646 -0.0986 -0.1110 -0.0866 -0.0308 -0.1489 -0.2812 -0.1362 -0.1932 0.0597 0.1168 0.0597 0.0848 0.1049 0.1025 0.0737 0.0735 0.1300 0.1314 0.0601 0.0641 0.1560 0.0807 0.0916 0.0801 0.1201 0.1460 0.1707 0.1603
va: 1.2456 1.2201 2.0213 1.9804 3.3598 2.8795 3.0345 3.8686 3.8353 3.9363 3.9512 3.8335 3.5745 3.8671 4.0050 3.8682 3.9437 4.0817 4.0802 4.0676 3.8600 4.0443 1.0054 1.0020 0.9941 1.0182 1.0115 1.0215 1.0272 1.0106 1.0091 1.0159 1.0008 1.0031 1.0009 1.0253 1.0058 1.0036 0.9963
dispcorr: -0.021987065 hartree
energy: -1817.066174088986
dipole: -34.99187 33.77503 -1.21683 -20.53421 18.86665 -1.66756 19.23015 -17.70468 1.52546
magnitude: 2.56680 au
magnitude: 6.52430 debye
