program: Orca
programVersion: 4.2.1
elementType: Cl Cl O O N N N C C C C C C C C C C C C C C C H H H H H H H H H H H H H H H H H
charge: 0
multiplicity: 1
keywords: wb97x-d3
keywords: def2-TZVPP
keywords: def2/J RIJCOSX GRIDX6 NOFINALGRIDX
keywords: grid4 nofinalgrid
keywords: scfconv7
keywords: smallprint printgap noloewdin
keywords: NOSOSCF
formula: C15H17Cl2N3O2
InChI: InChI=1/C15H17Cl2N3O2/c1-2-3-12-7-21-15(22-12,8-20-10-18-9-19-20)13-5-4-11(16)6-14(13)17/h4-6,9-10,12H,2-3,7-8H2,1H3
39 atoms
Cl 1.638084 2.152212 1.307223
Cl 5.599026 -0.982687 -0.379017
O  -1.048048 -0.951307 -0.578195
O  -0.787536 0.459871 1.128418
N  -2.066578 1.628542 -1.126581
N  -2.857998 1.126587 -2.076473
N  -4.056898 2.314586 -0.606441
C  -0.335903 0.173954 -0.156159
C  -1.66466 -1.58517 0.545999
C  -1.09983 -0.788416 1.719494
C  -3.178651 -1.509538 0.419237
C  -0.657881 1.34486 -1.090487
C  1.168531 -0.102535 -0.178247
C  -3.92038 -2.379737 1.431412
C  2.104616 0.727906 0.437665
C  1.657153 -1.20977 -0.865339
C  -3.794425 -3.875381 1.17472
C  3.465306 0.465145 0.38126
C  3.009626 -1.497601 -0.936204
C  -2.794691 2.328905 -0.252654
C  3.905049 -0.651622 -0.306991
C  -4.039701 1.564868 -1.726825
H  -1.330072 -2.625271 0.580208
H  -1.815125 -0.621468 2.524701
H  -0.206881 -1.259975 2.144067
H  -3.464728 -1.80996 -0.592692
H  -3.493952 -0.468386 0.536218
H  -0.333703 1.106026 -2.101818
H  -0.124357 2.24125 -0.779378
H  -4.977278 -2.104493 1.406371
H  -3.58243 -2.150796 2.447317
H  0.963509 -1.872764 -1.362612
H  -4.146938 -4.133738 0.174062
H  -2.766301 -4.230348 1.262061
H  -4.390463 -4.445938 1.88841
H  4.168516 1.125928 0.869081
H  3.352937 -2.369365 -1.475619
H  -2.369914 2.832184 0.601124
H  -4.923481 1.342444 -2.304635
elementType: Cl O N C H
totalener: -1817.04380497 hartree
nucrepener: 2162.55951246 hartree
electener: -3979.60331743 hartree
oneelecener: -6790.40181627 hartree
twoeener: 2810.79849884 hartree
cpcmener: -0.02353146 hartree
kineticenergy: 1811.90590405 hartree
xcener: -128.815050052788 hartree
chargesum: 0.0000000
charge: -0.074625 -0.081700 -0.397186 -0.364648 0.130834 -0.337341 -0.408243 0.585911 0.144496 0.019312 -0.173018 -0.133350 -0.138477 -0.103558 -0.014500 -0.127574 -0.271307 -0.155809 -0.188236 0.062111 0.120265 0.050922 0.101507 0.109581 0.094710 0.073732 0.074392 0.131350 0.150389 0.074824 0.055668 0.151052 0.081412 0.076722 0.092400 0.121994 0.145677 0.160973 0.159339
qa: -0.0746 -0.0817 -0.3972 -0.3646 0.1308 -0.3373 -0.4082 0.5859 0.1445 0.0193 -0.1730 -0.1333 -0.1385 -0.1036 -0.0145 -0.1276 -0.2713 -0.1558 -0.1882 0.0621 0.1203 0.0509 0.1015 0.1096 0.0947 0.0737 0.0744 0.1313 0.1504 0.0748 0.0557 0.1511 0.0814 0.0767 0.0924 0.1220 0.1457 0.1610 0.1593
va: 1.2449 1.2224 2.0046 1.9932 3.3705 2.8842 3.0168 3.8801 3.8782 3.9148 3.9564 3.8035 3.5650 3.9068 4.0059 3.9484 3.9297 4.0869 4.0559 4.0615 3.8575 4.0479 0.9967 0.9995 1.0055 1.0207 1.0151 1.0231 1.0156 1.0055 1.0134 1.0240 1.0015 1.0028 1.0038 1.0262 1.0072 1.0070 0.9976
dispcorr: -0.022271857 hartree
energy: -1817.066076824037
dipole: -37.31563 38.12911 0.81348 -19.83073 18.67322 -1.15752 4.14474 -3.43054 0.71420
magnitude: 1.58483 au
magnitude: 4.02832 debye
