program: Orca
programVersion: 4.2.1
elementType: Cl Cl O O N N N C C C C C C C C C C C C C C C H H H H H H H H H H H H H H H H H
charge: 0
multiplicity: 1
keywords: wb97x-d3
keywords: def2-TZVPP
keywords: def2/J RIJCOSX GRIDX6 NOFINALGRIDX
keywords: grid4 nofinalgrid
keywords: scfconv7
keywords: smallprint printgap noloewdin
keywords: NOSOSCF
formula: C15H17Cl2N3O2
InChI: InChI=1/C15H17Cl2N3O2/c1-2-3-12-7-21-15(22-12,8-20-10-18-9-19-20)13-5-4-11(16)6-14(13)17/h4-6,9-10,12H,2-3,7-8H2,1H3
39 atoms
Cl 0.988016 -0.486895 -2.298874
Cl 5.758871 -0.435932 0.066664
O  -0.936769 -0.628071 -0.062373
O  -0.562504 0.545716 1.810911
N  -2.030462 1.880438 -0.368478
N  -2.780049 2.331252 0.641139
N  -4.07517 1.719904 -1.086364
C  -0.21317 0.436221 0.458927
C  -1.203541 -1.518743 1.008325
C  -1.377985 -0.550202 2.172085
C  -2.38136 -2.417883 0.685615
C  -0.607945 1.734429 -0.261925
C  1.292503 0.207989 0.332742
C  -3.660411 -1.716768 0.243437
C  1.898349 -0.206666 -0.852949
C  2.123455 0.432555 1.425764
C  -4.796571 -2.704421 0.019071
C  3.267502 -0.407352 -0.940865
C  3.493132 0.243248 1.362115
C  -2.820151 1.5103 -1.386447
C  4.057152 -0.182856 0.172907
C  -3.996328 2.219424 0.165532
H  -0.319964 -2.148519 1.189869
H  -2.412979 -0.218047 2.294266
H  -1.032869 -0.972555 3.11799
H  -2.57694 -3.02452 1.576749
H  -2.073448 -3.126138 -0.088703
H  -0.188974 1.756838 -1.266885
H  -0.201787 2.581869 0.288923
H  -3.478892 -1.160887 -0.676042
H  -3.971223 -0.975971 0.983812
H  1.684233 0.76184 2.356346
H  -5.042233 -3.249107 0.932497
H  -5.699212 -2.193055 -0.313701
H  -4.537469 -3.441789 -0.742692
H  3.708913 -0.736708 -1.870642
H  4.112002 0.423214 2.229663
H  -2.4355 1.101987 -2.3084
H  -4.859826 2.51874 0.738807
totalener: -1817.01762664 hartree
nucrepener: 2181.87567588 hartree
electener: -3998.89330251 hartree
oneelecener: -6829.01091052 hartree
twoeener: 2830.11760801 hartree
kineticenergy: 1811.92128068 hartree
xcener: -128.816964332151 hartree
chargesum: 0.0000000
charge: -0.062333 -0.064662 -0.352321 -0.348382 0.140197 -0.310312 -0.332358 0.564003 0.144743 -0.015832 -0.146217 -0.139159 -0.116307 -0.076413 -0.031866 -0.121386 -0.273848 -0.156754 -0.162621 0.020961 0.111389 0.052718 0.083367 0.085193 0.088685 0.060527 0.077580 0.131078 0.123178 0.081842 0.047625 0.141502 0.072684 0.095561 0.075659 0.114481 0.124970 0.142111 0.130720
qa: -0.0623 -0.0647 -0.3523 -0.3484 0.1402 -0.3103 -0.3324 0.5640 0.1447 -0.0158 -0.1462 -0.1392 -0.1163 -0.0764 -0.0319 -0.1214 -0.2738 -0.1568 -0.1626 0.0210 0.1114 0.0527 0.0834 0.0852 0.0887 0.0605 0.0776 0.1311 0.1232 0.0818 0.0476 0.1415 0.0727 0.0956 0.0757 0.1145 0.1250 0.1421 0.1307
va: 1.2586 1.2408 2.0208 2.0185 3.3267 2.8672 3.0301 3.8586 3.9077 4.0049 3.9356 3.8314 3.6072 3.8773 4.0282 3.9533 3.9638 4.0834 4.0521 4.0780 3.9199 4.0337 0.9959 1.0022 0.9990 1.0105 1.0091 1.0162 1.0245 1.0137 1.0199 1.0295 1.0019 1.0051 1.0022 1.0275 1.0146 1.0064 1.0026
dispcorr: -0.022961771 hartree
energy: -1817.040588408354
dipole: -36.71888 37.36405 0.64518 -10.15329 9.48333 -0.66997 10.88877 -10.37241 0.51636
magnitude: 1.06383 au
magnitude: 2.70404 debye
