program: Orca
programVersion: 4.2.1
elementType: Cl Cl O O N N N C C C C C C C C C C C C C C C H H H H H H H H H H H H H H H H H
charge: 0
multiplicity: 1
keywords: wb97x-d3
keywords: def2-TZVPP
keywords: def2/J RIJCOSX GRIDX6 NOFINALGRIDX
keywords: grid4 nofinalgrid
keywords: scfconv7
keywords: smallprint printgap noloewdin
keywords: NOSOSCF
formula: C15H17Cl2N3O2
InChI: InChI=1/C15H17Cl2N3O2/c1-2-3-12-7-21-15(22-12,8-20-10-18-9-19-20)13-5-4-11(16)6-14(13)17/h4-6,9-10,12H,2-3,7-8H2,1H3
39 atoms
Cl 1.64229 2.144057 1.313748
Cl 5.599853 -1.005392 -0.349998
O  -1.031581 -0.963783 -0.57678
O  -0.782055 0.471443 1.113675
N  -2.070658 1.622478 -1.127149
N  -2.872902 1.144235 -2.083129
N  -4.062807 2.276533 -0.556002
C  -0.330724 0.171048 -0.167819
C  -1.661829 -1.574719 0.544488
C  -1.108332 -0.761228 1.715686
C  -3.174895 -1.502604 0.401783
C  -0.66558 1.331349 -1.112298
C  1.17435 -0.099228 -0.18697
C  -3.923975 -2.36554 1.415038
C  2.107913 0.721754 0.444527
C  1.664507 -1.197185 -0.887538
C  -3.780127 -3.865177 1.184766
C  3.466804 0.446756 0.400512
C  3.015607 -1.489552 -0.950571
C  -2.798735 2.291649 -0.219983
C  3.911547 -0.66251 -0.296231
C  -4.053942 1.562782 -1.702711
H  -1.331131 -2.616463 0.598631
H  -1.838483 -0.579208 2.504586
H  -0.223381 -1.230806 2.161405
H  -3.445872 -1.809997 -0.611579
H  -3.494415 -0.461278 0.501029
H  -0.368641 1.068525 -2.125964
H  -0.111884 2.223204 -0.819953
H  -4.982302 -2.100348 1.371266
H  -3.606624 -2.117786 2.433611
H  0.965505 -1.844413 -1.397855
H  -4.105984 -4.139548 0.180183
H  -2.751435 -4.209722 1.299309
H  -4.386343 -4.430681 1.892264
H  4.167667 1.095507 0.906274
H  3.364808 -2.351639 -1.5009
H  -2.369103 2.766029 0.648047
H  -4.943535 1.350438 -2.274706
totalener: -1817.01787531 hartree
nucrepener: 2164.02794536 hartree
electener: -3981.04582067 hartree
oneelecener: -6793.16421986 hartree
twoeener: 2812.11839919 hartree
kineticenergy: 1811.91558985 hartree
xcener: -128.814978670554 hartree
chargesum: -0.0000000
charge: -0.059064 -0.063654 -0.362534 -0.341773 0.111781 -0.288970 -0.332719 0.575100 0.133872 0.010976 -0.184599 -0.133412 -0.161510 -0.108594 -0.011898 -0.110778 -0.252875 -0.159643 -0.170406 0.032147 0.114547 0.047022 0.086188 0.096837 0.084582 0.085829 0.084511 0.122435 0.138305 0.078353 0.048157 0.142217 0.080439 0.068514 0.089359 0.114165 0.126072 0.142731 0.128290
qa: -0.0591 -0.0637 -0.3625 -0.3418 0.1118 -0.2890 -0.3327 0.5751 0.1339 0.0110 -0.1846 -0.1334 -0.1615 -0.1086 -0.0119 -0.1108 -0.2529 -0.1596 -0.1704 0.0321 0.1145 0.0470 0.0862 0.0968 0.0846 0.0858 0.0845 0.1224 0.1383 0.0784 0.0482 0.1422 0.0804 0.0685 0.0894 0.1142 0.1261 0.1427 0.1283
va: 1.2616 1.2419 2.0282 2.0053 3.3604 2.8673 3.0393 3.8720 3.9028 3.9334 3.9475 3.8159 3.6040 3.8998 4.0226 3.9482 3.9304 4.0873 4.0597 4.0708 3.9208 4.0463 0.9979 1.0023 1.0049 1.0197 1.0186 1.0262 1.0162 1.0071 1.0144 1.0277 1.0041 1.0047 1.0060 1.0284 1.0143 1.0126 1.0039
dispcorr: -0.022364191 hartree
energy: -1817.040239498736
dipole: -37.35627 37.91628 0.56001 -19.68196 18.73517 -0.94679 3.99341 -3.47537 0.51803
magnitude: 1.21589 au
magnitude: 3.09055 debye
