program: Orca
programVersion: 4.2.1
elementType: Cl Cl O O N N N C C C C C C C C C C C C C C C H H H H H H H H H H H H H H H H H
charge: 0
multiplicity: 1
keywords: wb97x-d3
keywords: def2-TZVPP
keywords: def2/J RIJCOSX GRIDX6 NOFINALGRIDX
keywords: grid4 nofinalgrid
keywords: scfconv7
keywords: smallprint printgap noloewdin
keywords: NOSOSCF
formula: C15H17Cl2N3O2
InChI: InChI=1/C15H17Cl2N3O2/c1-2-3-12-7-21-15(22-12,8-20-10-18-9-19-20)13-5-4-11(16)6-14(13)17/h4-6,9-10,12H,2-3,7-8H2,1H3
39 atoms
Cl -0.137274 -1.193973 2.105561
Cl 1.181125 -5.326512 -0.986421
O  -0.751356 0.963748 0.242411
O  0.431794 1.258555 -1.641289
N  1.454719 2.624955 0.660159
N  1.900451 3.573226 -0.168889
N  0.67394 4.481336 1.478135
C  0.455959 0.645529 -0.385129
C  -1.597856 1.671452 -0.662244
C  -0.931698 1.407799 -2.000744
C  -3.023836 1.18249 -0.554585
C  1.638444 1.222039 0.401962
C  0.610711 -0.868234 -0.508292
C  -3.636935 1.388702 0.824616
C  0.37005 -1.749118 0.545352
C  1.04869 -1.417186 -1.709247
C  -5.092771 0.953637 0.878713
C  0.541957 -3.118278 0.407243
C  1.225767 -2.780259 -1.876667
C  0.714495 3.17988 1.620619
C  0.966439 -3.62138 -0.809842
C  1.413414 4.660576 0.36731
H  -1.555709 2.74235 -0.422795
H  -1.318781 0.497881 -2.476011
H  -1.022583 2.235566 -2.70202
H  -3.067886 0.123924 -0.829949
H  -3.613398 1.723966 -1.301498
H  2.565328 1.08367 -0.152228
H  1.749469 0.708149 1.355505
H  -3.560153 2.444191 1.102237
H  -3.060942 0.831362 1.567005
H  1.259539 -0.768049 -2.54701
H  -5.517996 1.110011 1.870615
H  -5.702004 1.514156 0.167277
H  -5.199782 -0.105885 0.639273
H  0.346047 -3.77882 1.240154
H  1.56289 -3.17118 -2.826042
H  0.250999 2.609061 2.408679
H  1.603757 5.632255 -0.06018
elementType: Cl O N C H
totalener: -1817.03578165 hartree
nucrepener: 2172.28000240 hartree
electener: -3989.31578405 hartree
oneelecener: -6809.80002199 hartree
twoeener: 2820.48423793 hartree
cpcmener: -0.02632719 hartree
kineticenergy: 1811.94338148 hartree
xcener: -128.819561993818 hartree
chargesum: 0.0000000
charge: -0.077326 -0.084710 -0.364978 -0.387723 0.141163 -0.360209 -0.415152 0.595833 0.162910 -0.015757 -0.165359 -0.136205 -0.080159 -0.060706 -0.061624 -0.131448 -0.286791 -0.142895 -0.182858 0.058977 0.111812 0.057346 0.078630 0.091294 0.119189 0.060191 0.079542 0.132184 0.149922 0.055558 0.059014 0.152614 0.091292 0.080228 0.079956 0.123192 0.147559 0.163152 0.162340
qa: -0.0773 -0.0847 -0.3650 -0.3877 0.1412 -0.3602 -0.4152 0.5958 0.1629 -0.0158 -0.1654 -0.1362 -0.0802 -0.0607 -0.0616 -0.1314 -0.2868 -0.1429 -0.1829 0.0590 0.1118 0.0573 0.0786 0.0913 0.1192 0.0602 0.0795 0.1322 0.1499 0.0556 0.0590 0.1526 0.0913 0.0802 0.0800 0.1232 0.1476 0.1632 0.1623
va: 1.2394 1.2195 2.0051 1.9867 3.3487 2.8953 3.0246 3.8274 3.8644 3.9667 3.9546 3.8066 3.5737 3.8448 4.0445 3.9183 3.9457 4.0724 4.0448 4.0718 3.8591 4.0532 1.0019 1.0021 1.0003 1.0159 1.0126 1.0252 1.0104 1.0103 1.0199 1.0214 1.0036 1.0004 1.0003 1.0247 1.0063 1.0069 0.9952
dispcorr: -0.021854190 hartree
energy: -1817.057635841577
dipole: -24.17264 23.45778 -0.71486 23.21895 -24.24892 -1.02997 -4.30803 3.46248 -0.84555
magnitude: 1.51223 au
magnitude: 3.84377 debye
