program: Orca
programVersion: 4.2.1
elementType: Cl Cl O O N N N C C C C C C C C C C C C C C C H H H H H H H H H H H H H H H H H
charge: 0
multiplicity: 1
keywords: wb97x-d3
keywords: def2-TZVPP
keywords: def2/J RIJCOSX GRIDX6 NOFINALGRIDX
keywords: grid4 nofinalgrid
keywords: scfconv7
keywords: smallprint printgap noloewdin
keywords: NOSOSCF
formula: C15H17Cl2N3O2
InChI: InChI=1/C15H17Cl2N3O2/c1-2-3-12-7-21-15(22-12,8-20-10-18-9-19-20)13-5-4-11(16)6-14(13)17/h4-6,9-10,12H,2-3,7-8H2,1H3
39 atoms
Cl -0.370209 -0.649028 2.701819
Cl 2.050114 -4.190068 -0.45298
O  -1.725266 1.24496 0.892458
O  -0.779676 1.762054 -1.082958
N  1.748634 2.220073 0.332696
N  2.01368 3.004106 -0.716213
N  3.769986 1.681773 -0.26104
C  -0.515302 1.24636 0.19184
C  -2.794218 1.36765 -0.043185
C  -2.132859 2.189903 -1.136093
C  -3.321033 0.015011 -0.498283
C  0.449618 2.176349 0.950243
C  0.084068 -0.149745 0.047177
C  -4.623367 0.137341 -1.280731
C  0.198549 -1.040391 1.112957
C  0.614974 -0.551588 -1.175602
C  -5.156232 -1.214192 -1.729811
C  0.795254 -2.284348 0.967963
C  1.219445 -1.784583 -1.347902
C  2.797512 1.432593 0.579333
C  1.300906 -2.644822 -0.267838
C  3.231674 2.648173 -1.028636
H  -3.590775 1.926832 0.452721
H  -2.521967 1.992436 -2.135109
H  -2.210515 3.263306 -0.939189
H  -3.488084 -0.606814 0.385659
H  -2.572122 -0.501432 -1.108187
H  0.574496 1.840883 1.978599
H  0.038924 3.184843 0.980542
H  -4.477576 0.775094 -2.157363
H  -5.372195 0.639357 -0.661185
H  0.558024 0.111938 -2.025752
H  -6.098119 -1.110329 -2.269364
H  -4.450645 -1.718242 -2.392518
H  -5.335561 -1.87262 -0.877983
H  0.864322 -2.957062 1.811325
H  1.619761 -2.06252 -2.31252
H  2.818296 0.7161 1.385743
H  3.761695 3.115255 -1.84371
elementType: Cl O N C H
totalener: -1817.03296428 hartree
nucrepener: 2199.07756526 hartree
electener: -4016.11052954 hartree
oneelecener: -6863.73589606 hartree
twoeener: 2847.62536652 hartree
cpcmener: -0.02809706 hartree
kineticenergy: 1811.93290197 hartree
xcener: -128.819925700109 hartree
chargesum: 0.0000000
charge: -0.072432 -0.082930 -0.386709 -0.394492 0.132722 -0.352488 -0.406199 0.561615 0.199678 0.009920 -0.192429 -0.140723 -0.152425 -0.088768 0.019820 -0.131719 -0.279238 -0.136710 -0.174307 0.051680 0.118269 0.061925 0.105601 0.099498 0.091471 0.069823 0.076026 0.144522 0.120649 0.060747 0.065256 0.145542 0.092276 0.081589 0.080273 0.120981 0.149105 0.169709 0.162870
qa: -0.0724 -0.0829 -0.3867 -0.3945 0.1327 -0.3525 -0.4062 0.5616 0.1997 0.0099 -0.1924 -0.1407 -0.1524 -0.0888 0.0198 -0.1317 -0.2792 -0.1367 -0.1743 0.0517 0.1183 0.0619 0.1056 0.0995 0.0915 0.0698 0.0760 0.1445 0.1206 0.0607 0.0653 0.1455 0.0923 0.0816 0.0803 0.1210 0.1491 0.1697 0.1629
va: 1.2469 1.2209 2.0118 1.9693 3.3328 2.8962 3.0272 3.8874 3.9185 3.9714 3.9458 3.9072 3.4942 3.8865 3.9375 3.8638 3.9404 4.0960 4.0630 4.0807 3.8531 4.0509 0.9977 0.9952 0.9992 1.0228 1.0025 1.0113 1.0217 1.0124 1.0088 1.0302 1.0035 1.0013 1.0005 1.0261 1.0037 0.9938 0.9954
dispcorr: -0.022808908 hartree
energy: -1817.055773186117
dipole: -30.30701 28.14347 -2.16354 12.95204 -12.77235 0.17969 -14.02315 14.05697 0.03383
magnitude: 2.17125 au
magnitude: 5.51888 debye
