program: Orca
programVersion: 4.2.1
elementType: Cl Cl O O N N N C C C C C C C C C C C C C C C H H H H H H H H H H H H H H H H H
charge: 0
multiplicity: 1
keywords: wb97x-d3
keywords: def2-TZVPP
keywords: def2/J RIJCOSX GRIDX6 NOFINALGRIDX
keywords: grid4 nofinalgrid
keywords: scfconv7
keywords: smallprint printgap noloewdin
keywords: NOSOSCF
formula: C15H17Cl2N3O2
InChI: InChI=1/C15H17Cl2N3O2/c1-2-3-12-7-21-15(22-12,8-20-10-18-9-19-20)13-5-4-11(16)6-14(13)17/h4-6,9-10,12H,2-3,7-8H2,1H3
39 atoms
Cl -0.576559 -0.592911 2.541581
Cl 2.091981 -4.021654 -0.536926
O  -1.751603 1.4030 0.731655
O  -0.738476 1.964602 -1.164661
N  1.789387 2.212031 0.399292
N  2.670598 1.389234 0.975562
N  3.518761 2.247355 -0.916571
C  -0.50984 1.400512 0.09445
C  -2.775582 1.308126 -0.26002
C  -2.008724 1.485059 -1.577548
C  -3.538277 0.001129 -0.16595
C  0.435044 2.317154 0.87874
C  0.081435 -0.002541 -0.046626
C  -4.706274 -0.040814 -1.144791
C  0.109864 -0.932223 0.989562
C  0.71449 -0.357065 -1.234678
C  -5.491903 -1.339296 -1.054016
C  0.716707 -2.171015 0.846205
C  1.336063 -1.581799 -1.404391
C  2.303263 2.700165 -0.731314
C  1.326144 -2.483193 -0.355572
C  3.684946 1.44844 0.154711
H  -3.462717 2.143775 -0.095808
H  -1.913508 0.537823 -2.121455
H  -2.456493 2.220446 -2.243387
H  -3.915611 -0.121733 0.852761
H  -2.860093 -0.837175 -0.35715
H  0.433228 2.052944 1.933496
H  0.0960 3.34906 0.788462
H  -4.344405 0.088978 -2.169427
H  -5.371716 0.804878 -0.948505
H  0.733026 0.340746 -2.060047
H  -5.88776 -1.493026 -0.048555
H  -6.336214 -1.341511 -1.744042
H  -4.86585 -2.199707 -1.296498
H  0.719485 -2.875326 1.666383
H  1.819043 -1.820405 -2.341297
H  1.77478 3.389671 -1.370049
H  4.592437 0.896083 0.341151
elementType: Cl O N C H
totalener: -1817.03429790 hartree
nucrepener: 2212.35338605 hartree
electener: -4029.38768395 hartree
oneelecener: -6890.44863853 hartree
twoeener: 2861.06095458 hartree
cpcmener: -0.02709364 hartree
kineticenergy: 1811.93344766 hartree
xcener: -128.819460592316 hartree
chargesum: -0.0000000
charge: -0.075137 -0.084969 -0.385855 -0.391019 0.107069 -0.333618 -0.406802 0.611168 0.214447 -0.067887 -0.180464 -0.079379 -0.167792 -0.087636 -0.012928 -0.147988 -0.283020 -0.137191 -0.197088 0.056066 0.122357 0.058392 0.099428 0.098725 0.127713 0.069491 0.064119 0.130199 0.133727 0.064194 0.067314 0.157884 0.080733 0.092657 0.081128 0.119950 0.148333 0.172921 0.160758
qa: -0.0751 -0.0850 -0.3859 -0.3910 0.1071 -0.3336 -0.4068 0.6112 0.2144 -0.0679 -0.1805 -0.0794 -0.1678 -0.0876 -0.0129 -0.1480 -0.2830 -0.1372 -0.1971 0.0561 0.1224 0.0584 0.0994 0.0987 0.1277 0.0695 0.0641 0.1302 0.1337 0.0642 0.0673 0.1579 0.0807 0.0927 0.0811 0.1199 0.1483 0.1729 0.1608
va: 1.2426 1.2188 2.0097 1.9770 3.3713 2.8847 3.0282 3.8069 3.8464 3.9529 3.9799 3.8167 3.5332 3.8813 3.9665 3.8612 3.9443 4.0948 4.0833 4.0689 3.8494 4.0455 1.0032 0.9931 0.9937 1.0195 1.0041 1.0254 1.0208 1.0096 1.0086 1.0148 1.0007 1.0028 1.0009 1.0261 1.0053 1.0046 0.9969
dispcorr: -0.023306958 hartree
energy: -1817.057604855690
dipole: -31.11538 28.83282 -2.28256 11.15491 -10.51503 0.63987 -13.17901 12.15822 -1.02079
magnitude: 2.58100 au
magnitude: 6.56037 debye
