program: Orca
programVersion: 4.2.1
elementType: Cl Cl O O N N N C C C C C C C C C C C C C C C H H H H H H H H H H H H H H H H H
charge: 0
multiplicity: 1
keywords: wb97x-d3
keywords: def2-TZVPP
keywords: def2/J RIJCOSX GRIDX6 NOFINALGRIDX
keywords: grid4 nofinalgrid
keywords: scfconv7
keywords: smallprint printgap noloewdin
keywords: NOSOSCF
formula: C15H17Cl2N3O2
InChI: InChI=1/C15H17Cl2N3O2/c1-2-3-12-7-21-15(22-12,8-20-10-18-9-19-20)13-5-4-11(16)6-14(13)17/h4-6,9-10,12H,2-3,7-8H2,1H3
39 atoms
Cl 0.02721 -0.947059 2.166143
Cl 0.223796 -5.155444 -1.090522
O  -0.560994 1.332933 0.352937
O  0.455885 1.472765 -1.618224
N  1.869675 2.658689 0.591059
N  1.598479 3.110692 1.818479
N  1.880703 4.823027 0.395484
C  0.521519 0.842449 -0.371476
C  -1.624016 1.606917 -0.557172
C  -0.910475 1.710072 -1.914288
C  -2.708888 0.545025 -0.540382
C  1.842167 1.253764 0.282729
C  0.464312 -0.678125 -0.521695
C  -3.418006 0.395146 0.797655
C  0.225473 -1.536833 0.55057
C  0.659277 -1.259973 -1.770109
C  -4.479097 -0.693916 0.761275
C  0.14897 -2.910893 0.385775
C  0.591155 -2.629666 -1.964599
C  2.022282 3.687489 -0.243568
C  0.326994 -3.444289 -0.878712
C  1.62296 4.405603 1.649206
H  -2.051585 2.568311 -0.261196
H  -1.289027 0.969787 -2.626534
H  -1.000645 2.697565 -2.365878
H  -2.290593 -0.418186 -0.851522
H  -3.438197 0.820501 -1.309691
H  2.658712 1.014645 -0.398026
H  2.018841 0.708906 1.206158
H  -3.877186 1.348749 1.075076
H  -2.688733 0.163979 1.577048
H  0.866069 -0.631971 -2.625012
H  -4.0375 -1.666423 0.534873
H  -4.994705 -0.782856 1.718101
H  -5.233639 -0.491132 -0.001269
H  -0.04562 -3.551835 1.23433
H  0.740481 -3.046414 -2.950578
H  2.257377 3.570376 -1.288858
H  1.450606 5.083047 2.470852
elementType: Cl O N C H
totalener: -1817.03488898 hartree
nucrepener: 2197.01280209 hartree
electener: -4014.04769107 hartree
oneelecener: -6859.44033353 hartree
twoeener: 2845.39264246 hartree
cpcmener: -0.02927178 hartree
kineticenergy: 1811.93986978 hartree
xcener: -128.820721646463 hartree
chargesum: 0.0000000
charge: -0.078637 -0.083331 -0.376145 -0.393757 0.117041 -0.350947 -0.422730 0.578929 0.247728 -0.049967 -0.224136 -0.090697 -0.156461 -0.095007 -0.017821 -0.121294 -0.280158 -0.146068 -0.189829 0.068875 0.117419 0.056210 0.103698 0.101157 0.108197 0.070241 0.094973 0.146289 0.133364 0.067170 0.060643 0.153253 0.078175 0.092057 0.080651 0.122200 0.148330 0.168622 0.161766
qa: -0.0786 -0.0833 -0.3761 -0.3938 0.1170 -0.3509 -0.4227 0.5789 0.2477 -0.0500 -0.2241 -0.0907 -0.1565 -0.0950 -0.0178 -0.1213 -0.2802 -0.1461 -0.1898 0.0689 0.1174 0.0562 0.1037 0.1012 0.1082 0.0702 0.0950 0.1463 0.1334 0.0672 0.0606 0.1533 0.0782 0.0921 0.0807 0.1222 0.1483 0.1686 0.1618
va: 1.2387 1.2208 2.0006 1.9706 3.3745 2.8861 3.0250 3.8561 3.7928 3.9534 3.9427 3.7642 3.5514 3.8537 3.9762 3.9319 3.9440 4.0856 4.0542 4.0694 3.8544 4.0580 0.9955 0.9971 1.0016 0.9988 1.0132 1.0073 1.0315 1.0087 1.0265 1.0189 1.0010 1.0041 1.0013 1.0257 1.0059 1.0057 0.9953
dispcorr: -0.022832774 hartree
energy: -1817.057721756856
dipole: -20.13915 19.52595 -0.61320 16.09776 -17.18632 -1.08856 -6.01684 4.04631 -1.97054
magnitude: 2.33324 au
magnitude: 5.93062 debye
