program: Orca
programVersion: 4.2.1
elementType: Cl Cl O O N N N C C C C C C C C C C C C C C C H H H H H H H H H H H H H H H H H
charge: 0
multiplicity: 1
keywords: wb97x-d3
keywords: def2-TZVPP
keywords: def2/J RIJCOSX GRIDX6 NOFINALGRIDX
keywords: grid4 nofinalgrid
keywords: scfconv7
keywords: smallprint printgap noloewdin
keywords: NOSOSCF
formula: C15H17Cl2N3O2
InChI: InChI=1/C15H17Cl2N3O2/c1-2-3-12-7-21-15(22-12,8-20-10-18-9-19-20)13-5-4-11(16)6-14(13)17/h4-6,9-10,12H,2-3,7-8H2,1H3
39 atoms
Cl -0.705603 -0.577313 2.318859
Cl 2.179806 -4.006321 -0.556807
O  -1.918047 1.262484 0.30146
O  -0.713474 1.915513 -1.447239
N  1.588773 2.196503 0.556251
N  2.207058 2.649541 -0.536826
N  3.624006 1.453289 0.728992
C  -0.607878 1.349546 -0.173491
C  -2.783712 1.040678 -0.81301
C  -1.909057 1.41109 -2.021512
C  -3.300227 -0.385723 -0.875339
C  0.166954 2.31133 0.738277
C  0.07416 -0.018682 -0.243977
C  -4.116652 -0.831148 0.332912
C  0.065053 -0.932017 0.80845
C  0.792833 -0.371588 -1.38222
C  -5.401587 -0.042179 0.542298
C  0.704492 -2.158979 0.722044
C  1.443779 -1.587877 -1.496685
C  2.440099 1.473583 1.286941
C  1.385016 -2.477574 -0.439674
C  3.419385 2.184274 -0.383146
H  -3.616769 1.739808 -0.709861
H  -1.707236 0.540392 -2.65499
H  -2.34972 2.190844 -2.64109
H  -2.457524 -1.068544 -1.020218
H  -3.913886 -0.46532 -1.779167
H  -0.050146 2.091265 1.78119
H  -0.14838 3.33578 0.543596
H  -3.499177 -0.778203 1.232375
H  -4.364459 -1.887206 0.201809
H  0.849379 0.318671 -2.211338
H  -5.210389 1.002491 0.79205
H  -6.027296 -0.05753 -0.352424
H  -5.988288 -0.463577 1.359326
H  0.675147 -2.849679 1.553198
H  1.988184 -1.829788 -2.398434
H  2.163899 1.004605 2.21853
H  4.196267 2.387499 -1.103142
elementType: Cl O N C H
totalener: -1817.03311119 hartree
nucrepener: 2239.50927460 hartree
electener: -4056.54238579 hartree
oneelecener: -6944.64507390 hartree
twoeener: 2888.10268811 hartree
cpcmener: -0.02878478 hartree
kineticenergy: 1811.93392204 hartree
xcener: -128.821919213966 hartree
chargesum: 0.0000000
charge: -0.073732 -0.082352 -0.379644 -0.388255 0.128292 -0.351024 -0.401495 0.632868 0.194660 -0.048116 -0.208806 -0.138624 -0.165431 -0.109421 -0.045164 -0.144482 -0.281146 -0.105797 -0.177107 0.072209 0.104566 0.058003 0.112129 0.096608 0.112048 0.081018 0.095214 0.145327 0.125137 0.059111 0.073779 0.151395 0.081482 0.083623 0.093423 0.121583 0.148912 0.167781 0.161428
qa: -0.0737 -0.0824 -0.3796 -0.3883 0.1283 -0.3510 -0.4015 0.6329 0.1947 -0.0481 -0.2088 -0.1386 -0.1654 -0.1094 -0.0452 -0.1445 -0.2811 -0.1058 -0.1771 0.0722 0.1046 0.0580 0.1121 0.0966 0.1120 0.0810 0.0952 0.1453 0.1251 0.0591 0.0738 0.1514 0.0815 0.0836 0.0934 0.1216 0.1489 0.1678 0.1614
va: 1.2411 1.2217 2.0030 1.9774 3.3471 2.8916 3.0310 3.7617 3.8098 3.9709 3.9439 3.8611 3.5049 3.8769 3.9789 3.8750 3.9364 4.0681 4.0640 4.0557 3.8683 4.0573 0.9913 0.9954 0.9997 1.0018 1.0117 1.0064 1.0301 1.0262 1.0083 1.0249 0.9980 1.0001 1.0038 1.0233 1.0039 0.9999 0.9963
dispcorr: -0.024427768 hartree
energy: -1817.057538960667
dipole: -29.33516 27.29480 -2.04036 11.37925 -11.55225 -0.17300 -7.57926 7.08910 -0.49017
magnitude: 2.10553 au
magnitude: 5.35183 debye
