program: Orca
programVersion: 4.2.1
elementType: Cl Cl O O N N N C C C C C C C C C C C C C C C H H H H H H H H H H H H H H H H H
charge: 0
multiplicity: 1
keywords: wb97x-d3
keywords: def2-TZVPP
keywords: def2/J RIJCOSX GRIDX6 NOFINALGRIDX
keywords: grid4 nofinalgrid
keywords: scfconv7
keywords: smallprint printgap noloewdin
keywords: NOSOSCF
formula: C15H17Cl2N3O2
InChI: InChI=1/C15H17Cl2N3O2/c1-2-3-12-7-21-15(22-12,8-20-10-18-9-19-20)13-5-4-11(16)6-14(13)17/h4-6,9-10,12H,2-3,7-8H2,1H3
39 atoms
Cl -0.568199 -0.556541 2.550095
Cl 2.036109 -4.029065 -0.534805
O  -1.743255 1.433794 0.731842
O  -0.73003 1.98471 -1.165493
N  1.802468 2.216819 0.39818
N  2.675237 1.388096 0.978989
N  3.530799 2.223571 -0.919638
C  -0.501664 1.42305 0.095045
C  -2.761962 1.300813 -0.260222
C  -2.000046 1.504661 -1.578677
C  -3.477361 -0.033665 -0.169401
C  0.448778 2.337167 0.875355
C  0.081244 0.016529 -0.043567
C  -4.64705 -0.114344 -1.143625
C  0.105638 -0.909535 0.995853
C  0.703761 -0.348245 -1.233806
C  -5.365186 -1.452692 -1.075376
C  0.696161 -2.155983 0.85256
C  1.308946 -1.581051 -1.403756
C  2.320777 2.691504 -0.736432
C  1.293318 -2.479447 -0.35252
C  3.689573 1.430139 0.15709
H  -3.478894 2.110579 -0.095213
H  -1.901536 0.566729 -2.137778
H  -2.455531 2.247431 -2.231116
H  -3.844893 -0.175803 0.850335
H  -2.771189 -0.846386 -0.368701
H  0.442662 2.080355 1.931888
H  0.118702 3.3714 0.777582
H  -4.297157 0.053474 -2.166868
H  -5.352467 0.69314 -0.927759
H  0.725549 0.347358 -2.060929
H  -5.74239 -1.649208 -0.070309
H  -6.215138 -1.483045 -1.757648
H  -4.698303 -2.273978 -1.342922
H  0.695272 -2.857908 1.6747
H  1.782739 -1.828941 -2.342897
H  1.799424 3.382607 -1.378993
H  4.590654 0.868592 0.346506
elementType: Cl O N C H
totalener: -1817.03416768 hartree
nucrepener: 2216.24481325 hartree
electener: -4033.27898092 hartree
oneelecener: -6898.22328100 hartree
twoeener: 2864.94430008 hartree
cpcmener: -0.02712122 hartree
kineticenergy: 1811.93581899 hartree
xcener: -128.820173727631 hartree
chargesum: 0.0000000
charge: -0.074957 -0.084940 -0.385680 -0.391145 0.107017 -0.333306 -0.406845 0.610328 0.218677 -0.069946 -0.181932 -0.076520 -0.180047 -0.089152 -0.007753 -0.146173 -0.282167 -0.134772 -0.196371 0.055838 0.121194 0.058748 0.100149 0.098434 0.127105 0.069566 0.063668 0.130533 0.133717 0.064312 0.067972 0.157967 0.080154 0.092802 0.081564 0.119999 0.148344 0.172990 0.160626
qa: -0.0750 -0.0849 -0.3857 -0.3911 0.1070 -0.3333 -0.4068 0.6103 0.2187 -0.0699 -0.1819 -0.0765 -0.1800 -0.0892 -0.0078 -0.1462 -0.2822 -0.1348 -0.1964 0.0558 0.1212 0.0587 0.1001 0.0984 0.1271 0.0696 0.0637 0.1305 0.1337 0.0643 0.0680 0.1580 0.0802 0.0928 0.0816 0.1200 0.1483 0.1730 0.1606
va: 1.2430 1.2190 2.0102 1.9763 3.3712 2.8850 3.0279 3.8066 3.8447 3.9545 3.9800 3.8109 3.5293 3.8820 3.9601 3.8610 3.9436 4.0925 4.0838 4.0687 3.8500 4.0454 1.0027 0.9929 0.9940 1.0202 1.0032 1.0253 1.0212 1.0099 1.0085 1.0145 1.0008 1.0028 1.0010 1.0261 1.0053 1.0045 0.9969
dispcorr: -0.023439777 hartree
energy: -1817.057607452315
dipole: -30.53516 28.26972 -2.26544 10.63818 -10.01437 0.62382 -13.27981 12.25882 -1.02099
magnitude: 2.56199 au
magnitude: 6.51206 debye
