program: Orca
programVersion: 4.2.1
elementType: Cl Cl O O N N N C C C C C C C C C C C C C C C H H H H H H H H H H H H H H H H H
charge: 0
multiplicity: 1
keywords: wb97x-d3
keywords: def2-TZVPP
keywords: def2/J RIJCOSX GRIDX6 NOFINALGRIDX
keywords: grid4 nofinalgrid
keywords: scfconv7
keywords: smallprint printgap noloewdin
keywords: NOSOSCF
formula: C15H17Cl2N3O2
InChI: InChI=1/C15H17Cl2N3O2/c1-2-3-12-7-21-15(22-12,8-20-10-18-9-19-20)13-5-4-11(16)6-14(13)17/h4-6,9-10,12H,2-3,7-8H2,1H3
39 atoms
Cl -0.609831 -0.286378 2.465554
Cl 1.734195 -4.091124 -0.431842
O  -1.848341 1.548268 0.422652
O  -0.671946 1.997123 -1.436404
N  1.726614 2.171536 0.47693
N  2.313388 2.462071 -0.686677
N  3.68369 1.232185 0.598057
C  -0.566254 1.498784 -0.129464
C  -2.794223 1.533527 -0.644692
C  -2.033253 2.288708 -1.72323
C  -3.209693 0.128769 -1.054115
C  0.33105 2.42484 0.713789
C  -0.001639 0.077276 -0.179204
C  -3.772919 -0.70344 0.089508
C  0.008197 -0.776921 0.921305
C  0.575395 -0.399108 -1.3530
C  -4.095516 -2.126329 -0.338905
C  0.532352 -2.058883 0.854402
C  1.112471 -1.670977 -1.448501
C  2.54732 1.424765 1.218686
C  1.078935 -2.495355 -0.338736
C  3.47914 1.883604 -0.562118
H  -3.66673 2.092622 -0.300843
H  -2.268678 1.949366 -2.732672
H  -2.210811 3.366224 -1.667052
H  -2.369445 -0.397692 -1.518582
H  -3.967225 0.234438 -1.836943
H  0.145471 2.27269 1.774497
H  0.098169 3.464188 0.485101
H  -4.673958 -0.221488 0.480791
H  -3.058067 -0.731924 0.914148
H  0.602411 0.234069 -2.226806
H  -4.813067 -2.146757 -1.161181
H  -3.196932 -2.648461 -0.673708
H  -4.521124 -2.702206 0.483644
H  0.51734 -2.700881 1.723948
H  1.547581 -2.007463 -2.378944
H  2.288005 1.0698 2.20411
H  4.221526 1.940378 -1.342476
elementType: Cl O N C H
totalener: -1817.03234684 hartree
nucrepener: 2254.49211717 hartree
electener: -4071.52446401 hartree
oneelecener: -6974.83928019 hartree
twoeener: 2903.31481618 hartree
cpcmener: -0.02843547 hartree
kineticenergy: 1811.94090650 hartree
xcener: -128.823314560603 hartree
chargesum: 0.0000000
charge: -0.075944 -0.084038 -0.379418 -0.397756 0.133398 -0.348680 -0.400704 0.575837 0.203344 0.007942 -0.214823 -0.154485 -0.006149 -0.099731 -0.115302 -0.198571 -0.280807 -0.096602 -0.140393 0.068221 0.089546 0.055480 0.112312 0.094815 0.092284 0.077752 0.094861 0.138822 0.125838 0.072807 0.055952 0.142989 0.082797 0.077487 0.092521 0.120959 0.149291 0.167426 0.160721
qa: -0.0759 -0.0840 -0.3794 -0.3978 0.1334 -0.3487 -0.4007 0.5758 0.2033 0.0079 -0.2148 -0.1545 -0.0061 -0.0997 -0.1153 -0.1986 -0.2808 -0.0966 -0.1404 0.0682 0.0895 0.0555 0.1123 0.0948 0.0923 0.0778 0.0949 0.1388 0.1258 0.0728 0.0560 0.1430 0.0828 0.0775 0.0925 0.1210 0.1493 0.1674 0.1607
va: 1.2399 1.2200 2.0091 1.9704 3.3436 2.8880 3.0295 3.8078 3.8845 3.9906 3.9285 3.9152 3.4406 3.8658 3.9915 3.9046 3.9467 4.0460 4.0198 4.0549 3.8811 4.0581 0.9930 0.9914 0.9969 0.9981 1.0123 1.0080 1.0167 1.0085 1.0270 1.0366 1.0014 1.0004 1.0034 1.0228 1.0023 1.0011 0.9963
dispcorr: -0.024911638 hartree
energy: -1817.057258480932
dipole: -25.27999 23.04199 -2.23800 8.87087 -8.34494 0.52593 -10.25862 9.92302 -0.33560
magnitude: 2.32333 au
magnitude: 5.90543 debye
