program: Orca
programVersion: 4.2.1
elementType: Cl Cl O O N N N C C C C C C C C C C C C C C C H H H H H H H H H H H H H H H H H
charge: 0
multiplicity: 1
keywords: wb97x-d3
keywords: def2-TZVPP
keywords: def2/J RIJCOSX GRIDX6 NOFINALGRIDX
keywords: grid4 nofinalgrid
keywords: scfconv7
keywords: smallprint printgap noloewdin
keywords: NOSOSCF
formula: C15H17Cl2N3O2
InChI: InChI=1/C15H17Cl2N3O2/c1-2-3-12-7-21-15(22-12,8-20-10-18-9-19-20)13-5-4-11(16)6-14(13)17/h4-6,9-10,12H,2-3,7-8H2,1H3
39 atoms
Cl -0.613049 -0.300679 2.462435
Cl 1.749861 -4.088062 -0.44221
O  -1.847261 1.542674 0.427873
O  -0.671508 1.996396 -1.43084
N  1.727634 2.169079 0.480104
N  2.314125 2.475493 -0.679537
N  3.686457 1.232035 0.589935
C  -0.565509 1.494689 -0.125217
C  -2.794126 1.537525 -0.638723
C  -2.031749 2.297164 -1.712851
C  -3.214417 0.136528 -1.05553
C  0.331941 2.41829 0.720701
C  0.000022 0.073869 -0.179542
C  -3.784897 -0.697268 0.083318
C  0.009487 -0.784234 0.917911
C  0.580978 -0.396815 -1.353742
C  -4.122825 -2.113953 -0.35366
C  0.537707 -2.064377 0.847845
C  1.122273 -1.666666 -1.452257
C  2.549578 1.414606 1.212551
C  1.088794 -2.494925 -0.345366
C  3.480981 1.897896 -0.561762
H  -3.664648 2.097256 -0.290833
H  -2.270435 1.966986 -2.724529
H  -2.204172 3.37505 -1.647772
H  -2.375148 -0.391906 -1.519595
H  -3.969359 0.2488 -1.839961
H  0.148345 2.261138 1.78103
H  0.097204 3.458301 0.496933
H  -4.680695 -0.208573 0.478274
H  -3.069715 -0.73805 0.907226
H  0.608406 0.239319 -2.225393
H  -4.552457 -2.690836 0.466092
H  -4.842594 -2.121449 -1.174203
H  -3.230621 -2.643205 -0.694176
H  0.5224 -2.709408 1.715149
H  1.560823 -1.998486 -2.382757
H  2.290487 1.046661 2.193245
H  4.223689 1.966341 -1.340864
elementType: Cl O N C H
totalener: -1817.03242811 hartree
nucrepener: 2253.46348353 hartree
electener: -4070.49591164 hartree
oneelecener: -6972.77666080 hartree
twoeener: 2902.28074915 hartree
cpcmener: -0.02841898 hartree
kineticenergy: 1811.94159916 hartree
xcener: -128.823346050053 hartree
chargesum: 0.0000000
charge: -0.075984 -0.083997 -0.379447 -0.397356 0.133320 -0.348781 -0.400715 0.573867 0.202896 0.008762 -0.214269 -0.153792 -0.008640 -0.098947 -0.112902 -0.196356 -0.280461 -0.096818 -0.141720 0.067850 0.090377 0.055412 0.112148 0.094721 0.092202 0.077767 0.094434 0.138948 0.125725 0.072293 0.055819 0.142974 0.092447 0.082510 0.077450 0.120742 0.149317 0.167488 0.160717
qa: -0.0760 -0.0840 -0.3794 -0.3974 0.1333 -0.3488 -0.4007 0.5739 0.2029 0.0088 -0.2143 -0.1538 -0.0086 -0.0989 -0.1129 -0.1964 -0.2805 -0.0968 -0.1417 0.0679 0.0904 0.0554 0.1121 0.0947 0.0922 0.0778 0.0944 0.1389 0.1257 0.0723 0.0558 0.1430 0.0924 0.0825 0.0774 0.1207 0.1493 0.1675 0.1607
va: 1.2396 1.2200 2.0090 1.9706 3.3432 2.8883 3.0296 3.8120 3.8844 3.9911 3.9281 3.9147 3.4420 3.8660 3.9888 3.9043 3.9468 4.0463 4.0211 4.0557 3.8801 4.0585 0.9931 0.9915 0.9969 0.9982 1.0124 1.0080 1.0168 1.0085 1.0266 1.0365 1.0034 1.0014 1.0005 1.0229 1.0023 1.0010 0.9964
dispcorr: -0.024865396 hartree
energy: -1817.057293507304
dipole: -25.39034 23.15160 -2.23874 8.97052 -8.44528 0.52524 -10.24557 9.91429 -0.33128
magnitude: 2.32327 au
magnitude: 5.90528 debye
