program: Orca
programVersion: 4.2.1
elementType: Cl Cl O O N N N C C C C C C C C C C C C C C C H H H H H H H H H H H H H H H H H
charge: 0
multiplicity: 1
keywords: wb97x-d3
keywords: def2-TZVPP
keywords: def2/J RIJCOSX GRIDX6 NOFINALGRIDX
keywords: grid4 nofinalgrid
keywords: scfconv7
keywords: smallprint printgap noloewdin
keywords: NOSOSCF
formula: C15H17Cl2N3O2
InChI: InChI=1/C15H17Cl2N3O2/c1-2-3-12-7-21-15(22-12,8-20-10-18-9-19-20)13-5-4-11(16)6-14(13)17/h4-6,9-10,12H,2-3,7-8H2,1H3
39 atoms
Cl 1.194176 0.255785 -2.937194
Cl 2.149903 -4.150269 -0.103782
O  -1.584318 1.31597 0.452457
O  -1.201061 1.485519 -1.735183
N  1.243078 2.074091 0.902536
N  2.431582 1.469723 0.813674
N  1.807684 1.661567 2.9600
C  -0.57493 1.232745 -0.515357
C  -2.842804 1.020699 -0.166029
C  -2.473509 0.872514 -1.644328
C  -3.497268 -0.219241 0.410972
C  0.449348 2.34646 -0.267274
C  0.090843 -0.142697 -0.465611
C  -3.844297 -0.136949 1.893554
C  0.896119 -0.640686 -1.487332
C  -0.029505 -0.919716 0.682922
C  -4.937542 0.871221 2.217862
C  1.525658 -1.872734 -1.388679
C  0.595365 -2.147218 0.814703
C  0.88053 2.166971 2.184234
C  1.366094 -2.616451 -0.23336
C  2.728171 1.248742 2.066585
H  -3.486257 1.89299 -0.02029
H  -2.424495 -0.180979 -1.94495
H  -3.161556 1.38867 -2.31145
H  -2.849983 -1.082021 0.229516
H  -4.410507 -0.400675 -0.1661
H  -0.069914 3.296174 -0.140895
H  1.124392 2.440657 -1.114554
H  -2.945724 0.090675 2.473197
H  -4.167612 -1.127102 2.221968
H  -0.627598 -0.559193 1.507598
H  -4.654517 1.891586 1.954573
H  -5.859731 0.637689 1.68203
H  -5.168106 0.867896 3.283835
H  2.137265 -2.239457 -2.20123
H  0.478561 -2.723107 1.721805
H  -0.042092 2.623332 2.504592
H  3.653313 0.773194 2.35191
elementType: Cl O N C H
totalener: -1817.03278572 hartree
nucrepener: 2221.44547340 hartree
electener: -4038.47825913 hartree
oneelecener: -6908.55119382 hartree
twoeener: 2870.07293470 hartree
cpcmener: -0.02651080 hartree
kineticenergy: 1811.93152570 hartree
xcener: -128.820270786785 hartree
chargesum: 0.0000000
charge: -0.073114 -0.084804 -0.394454 -0.367748 0.109163 -0.337275 -0.408007 0.593371 0.134128 -0.007025 -0.196463 -0.079199 -0.101281 -0.102206 -0.013294 -0.202029 -0.276890 -0.146936 -0.190962 0.057211 0.120991 0.058638 0.101171 0.087726 0.117044 0.085649 0.095076 0.133192 0.128609 0.060363 0.073779 0.168358 0.080008 0.082955 0.093259 0.120452 0.146613 0.172159 0.161772
qa: -0.0731 -0.0848 -0.3945 -0.3677 0.1092 -0.3373 -0.4080 0.5934 0.1341 -0.0070 -0.1965 -0.0792 -0.1013 -0.1022 -0.0133 -0.2020 -0.2769 -0.1469 -0.1910 0.0572 0.1210 0.0586 0.1012 0.0877 0.1170 0.0856 0.0951 0.1332 0.1286 0.0604 0.0738 0.1684 0.0800 0.0830 0.0933 0.1205 0.1466 0.1722 0.1618
va: 1.2489 1.2194 1.9751 2.0069 3.3655 2.8842 3.0291 3.8540 3.8783 3.9618 3.9312 3.8215 3.4801 3.8711 3.9886 3.8692 3.9324 4.0896 4.0976 4.0686 3.8483 4.0442 0.9968 1.0028 0.9939 1.0050 1.0123 1.0184 1.0270 1.0170 1.0078 0.9990 1.0001 0.9998 1.0034 1.0255 1.0057 1.0054 0.9963
dispcorr: -0.023739572 hartree
energy: -1817.056525295538
dipole: -35.04147 32.53602 -2.50545 12.41493 -12.13812 0.27681 15.43163 -15.83226 -0.40064
magnitude: 2.55233 au
magnitude: 6.48752 debye
