program: Orca
programVersion: 4.2.1
elementType: Cl Cl O O N N N C C C C C C C C C C C C C C C H H H H H H H H H H H H H H H H H
charge: 0
multiplicity: 1
keywords: wb97x-d3
keywords: def2-TZVPP
keywords: def2/J RIJCOSX GRIDX6 NOFINALGRIDX
keywords: grid4 nofinalgrid
keywords: scfconv7
keywords: smallprint printgap noloewdin
keywords: NOSOSCF
formula: C15H17Cl2N3O2
InChI: InChI=1/C15H17Cl2N3O2/c1-2-3-12-7-21-15(22-12,8-20-10-18-9-19-20)13-5-4-11(16)6-14(13)17/h4-6,9-10,12H,2-3,7-8H2,1H3
39 atoms
Cl 1.996803 -0.763919 -1.991112
Cl 0.615987 -5.436572 0.159099
O  -0.821131 0.988471 1.068916
O  -0.074228 1.134942 -1.029567
N  1.456915 2.641832 0.793314
N  1.881397 3.394078 -0.226386
N  0.899539 4.670995 1.337793
C  0.223404 0.600323 0.220895
C  -1.93893 1.439571 0.296443
C  -1.485833 1.144317 -1.131205
C  -3.207052 0.740311 0.752836
C  1.522248 1.205537 0.760695
C  0.333277 -0.924062 0.177557
C  -4.495162 1.369761 0.229598
C  1.096929 -1.602488 -0.771724
C  -0.325284 -1.695666 1.130117
C  -4.70287 1.277016 -1.275915
C  1.188345 -2.986136 -0.786512
C  -0.250875 -3.078343 1.141197
C  0.865391 3.413947 1.706173
C  0.507102 -3.712613 0.173939
C  1.531224 4.594695 0.150484
H  -2.038727 2.520656 0.451341
H  -1.863464 0.177173 -1.48583
H  -1.770708 1.913149 -1.846658
H  -3.2335 0.772385 1.844939
H  -3.165068 -0.317145 0.470913
H  2.379613 0.91604 0.158276
H  1.692404 0.83477 1.77102
H  -4.536397 2.417712 0.540899
H  -5.330658 0.875571 0.730084
H  -0.918713 -1.210439 1.89108
H  -5.7003 1.623984 -1.548241
H  -3.994356 1.889872 -1.834409
H  -4.607085 0.248906 -1.630295
H  1.783721 -3.485171 -1.538071
H  -0.77956 -3.643762 1.895293
H  0.451304 3.029115 2.62407
H  1.744682 5.459099 -0.458579
elementType: Cl O N C H
totalener: -1817.03421572 hartree
nucrepener: 2163.04282868 hartree
electener: -3980.07704440 hartree
oneelecener: -6791.37434923 hartree
twoeener: 2811.29730484 hartree
cpcmener: -0.02887289 hartree
kineticenergy: 1811.93222865 hartree
xcener: -128.819007437512 hartree
chargesum: -0.0000000
charge: -0.075627 -0.083713 -0.409503 -0.365505 0.125444 -0.352715 -0.420437 0.576014 0.149830 -0.008707 -0.149964 -0.096542 -0.107445 -0.099946 -0.017985 -0.162764 -0.290471 -0.151275 -0.184418 0.056815 0.117737 0.057966 0.085446 0.095611 0.121210 0.079598 0.069461 0.133843 0.143804 0.059754 0.073672 0.158664 0.098166 0.083934 0.086638 0.122542 0.147566 0.171698 0.161608
qa: -0.0756 -0.0837 -0.4095 -0.3655 0.1254 -0.3527 -0.4204 0.5760 0.1498 -0.0087 -0.1500 -0.0965 -0.1074 -0.0999 -0.0180 -0.1628 -0.2905 -0.1513 -0.1844 0.0568 0.1177 0.0580 0.0854 0.0956 0.1212 0.0796 0.0695 0.1338 0.1438 0.0598 0.0737 0.1587 0.0982 0.0839 0.0866 0.1225 0.1476 0.1717 0.1616
va: 1.2448 1.2204 1.9781 2.0016 3.3755 2.8904 3.0205 3.8995 3.8498 3.9177 3.9576 3.7807 3.5416 3.9144 4.0034 3.9567 3.9246 4.0829 4.0582 4.0640 3.8543 4.0543 1.0001 1.0003 0.9970 1.0158 1.0082 1.0319 1.0054 1.0092 1.0054 1.0172 1.0048 1.0004 1.0013 1.0256 1.0065 1.0030 0.9954
dispcorr: -0.021922280 hartree
energy: -1817.056137998493
dipole: -31.44967 29.85534 -1.59433 21.57918 -22.89375 -1.31457 4.46803 -3.62270 0.84533
magnitude: 2.23262 au
magnitude: 5.67486 debye
