program: Orca
programVersion: 4.2.1
elementType: Cl Cl O O N N N C C C C C C C C C C C C C C C H H H H H H H H H H H H H H H H H
charge: 0
multiplicity: 1
keywords: wb97x-d3
keywords: def2-TZVPP
keywords: def2/J RIJCOSX GRIDX6 NOFINALGRIDX
keywords: grid4 nofinalgrid
keywords: scfconv7
keywords: smallprint printgap noloewdin
keywords: NOSOSCF
formula: C15H17Cl2N3O2
InChI: InChI=1/C15H17Cl2N3O2/c1-2-3-12-7-21-15(22-12,8-20-10-18-9-19-20)13-5-4-11(16)6-14(13)17/h4-6,9-10,12H,2-3,7-8H2,1H3
39 atoms
Cl 0.407481 -1.393983 2.297918
Cl 1.712833 -5.364156 -1.005145
O  -0.856322 0.607993 0.560129
O  -0.020479 1.046007 -1.482362
N  1.202225 2.594574 0.527202
N  0.663529 3.049242 1.662557
N  0.738295 4.6795 0.120179
C  0.276428 0.457307 -0.245839
C  -1.813884 1.424004 -0.108167
C  -1.423388 1.235199 -1.561363
C  -3.215371 0.970581 0.239746
C  1.493906 1.200296 0.325694
C  0.611813 -1.021432 -0.405155
C  -4.297881 1.812011 -0.433128
C  0.693849 -1.906056 0.669294
C  0.89864 -1.527328 -1.669041
C  -4.311921 3.271407 0.001036
C  1.027147 -3.24076 0.494104
C  1.235866 -2.854834 -1.873067
C  1.225034 3.571449 -0.381358
C  1.293455 -3.703142 -0.782429
C  0.407214 4.296491 1.368344
H  -1.671079 2.469827 0.193371
H  -1.915905 0.359787 -2.001769
H  -1.621074 2.102839 -2.188928
H  -3.347149 1.015704 1.324313
H  -3.329653 -0.076862 -0.052685
H  2.329992 1.112757 -0.368089
H  1.808196 0.774737 1.275755
H  -5.265455 1.36285 -0.200042
H  -4.199081 1.7518 -1.521113
H  0.860541 -0.87271 -2.527524
H  -5.168662 3.795231 -0.423787
H  -4.378448 3.359431 1.087075
H  -3.419311 3.811462 -0.318202
H  1.078843 -3.905775 1.344703
H  1.44957 -3.212899 -2.870063
H  1.622699 3.440904 -1.374668
H  -0.029824 4.966514 2.092003
elementType: Cl O N C H
totalener: -1817.03437732 hartree
nucrepener: 2166.79240182 hartree
electener: -3983.82677915 hartree
oneelecener: -6799.15265100 hartree
twoeener: 2815.32587185 hartree
cpcmener: -0.02728717 hartree
kineticenergy: 1811.93171065 hartree
xcener: -128.819430618408 hartree
chargesum: 0.0000000
charge: -0.075339 -0.084585 -0.362819 -0.409857 0.111241 -0.348633 -0.408327 0.583723 0.108895 0.018464 -0.136720 -0.116646 -0.065593 -0.114286 -0.052184 -0.127486 -0.277695 -0.145660 -0.183591 0.056761 0.112557 0.052294 0.065860 0.099116 0.114474 0.078569 0.073225 0.140064 0.137595 0.077740 0.064812 0.151065 0.096599 0.085854 0.075946 0.123294 0.148079 0.172797 0.160394
qa: -0.0753 -0.0846 -0.3628 -0.4099 0.1112 -0.3486 -0.4083 0.5837 0.1089 0.0185 -0.1367 -0.1166 -0.0656 -0.1143 -0.0522 -0.1275 -0.2777 -0.1457 -0.1836 0.0568 0.1126 0.0523 0.0659 0.0991 0.1145 0.0786 0.0732 0.1401 0.1376 0.0777 0.0648 0.1511 0.0966 0.0859 0.0759 0.1233 0.1481 0.1728 0.1604
va: 1.2433 1.2197 2.0306 1.9700 3.3891 2.8805 3.0239 3.8294 3.9634 3.8911 3.9319 3.8128 3.6110 3.8973 4.0432 3.9166 3.9277 4.0765 4.0451 4.0680 3.8594 4.0462 0.9860 1.0004 0.9969 1.0122 1.0175 1.0079 1.0268 1.0074 1.0067 1.0228 1.0039 1.0004 1.0005 1.0247 1.0060 1.0017 0.9978
dispcorr: -0.021946890 hartree
energy: -1817.056324213578
dipole: -26.53580 26.17414 -0.36166 29.96318 -30.61333 -0.65016 -8.03581 6.38242 -1.65339
magnitude: 1.81307 au
magnitude: 4.60845 debye
