program: Gaussian 09
title: 000068476
version: EM64L-G09RevD.01
frameworkgroup: C1[X(C9H8N2)]
method: RPBEPBE
basis: SDD
operation: Freq
keyword: #p
keyword: freq=noraman
keyword: PBEPBE/SDD
title: #p freq=noraman PBEPBE/SDD
converged: NO NO NO YES
title: Mulliken charges:
elementType: N N C C C C C C C C C H H H H H H H H
charge: -0.050122 -0.680344 0.288232 -0.044737 0.360085 -0.346080 -0.305003 -0.350034 -0.272793 -0.223784 -0.358920 0.191014 0.260005 0.212191 0.226381 0.229429 0.231926 0.318950 0.313603
chargesum: 0.00000
title: Mulliken charges with hydrogens summed into heavy atoms:
elementType: N N C C C C C C C C C
charge: -0.050122 -0.047791 0.288232 -0.044737 0.360085 -0.155066 -0.044998 -0.137842 -0.046412 0.005645 -0.126994
polarizability: 1.59057752e+02 3.57174328e+00 1.27246814e+02 -2.85132731e-03 5.34062903e-03 4.43870926e+01
1716.lowfreq: -0.0007 0.0004 0.0006 10.5608 14.6543 17.7260 112.3934 171.8670 248.1744
frequency: 112.3918 171.8649 248.1742 293.8277 358.1817 416.8429 446.7165 457.8903 474.2961 478.5540 508.9439 563.2942 588.7851 651.7368 701.2031 761.6765 790.0413 803.1872 831.3947 857.1781 867.8574 944.9395 953.7519 989.4673 993.0513 1024.8234 1084.9552 1107.9844 1148.6065 1176.9359 1222.3493 1266.3794 1323.9629 1343.1313 1389.5057 1398.8912 1441.5019 1457.7230 1526.6528 1554.2193 1588.0447 1623.7052 1648.2148 3109.0413 3114.0287 3133.0148 3142.5247 3152.8356 3169.8067 3568.5176 3706.8923
redmass: 3.2631 4.1348 4.4583 3.7756 1.2242 1.6727 1.5213 3.6486 2.9811 6.3000 6.5009 6.9891 3.4600 3.3264 5.1324 1.4809 2.5060 5.6537 1.3876 5.6652 1.8267 1.3890 1.3960 2.1285 1.3287 2.2681 1.9954 1.9153 1.4577 1.2114 1.9622 1.5392 2.5928 2.5691 4.5168 2.4340 2.3884 3.0443 4.3699 6.2696 5.4471 6.5498 1.2268 1.0864 1.0879 1.0884 1.0959 1.0947 1.0989 1.0454 1.1033
irintensity: 2.4633 5.6383 3.4277 3.3306 53.0687 185.5172 32.4813 2.8091 9.2589 1.2245 0.3466 1.8673 5.5264 5.1340 4.4723 78.9373 17.3766 2.4566 54.3645 13.4986 5.7737 0.1739 2.9287 0.4366 0.5090 9.4398 2.9394 14.9244 3.4138 0.8281 1.7862 0.0425 3.9549 32.8358 9.7777 37.0444 16.5575 11.1891 70.2791 47.1373 98.3006 11.6345 251.9248 11.0727 22.6020 13.4869 41.3244 24.4296 18.9603 62.8581 22.7223
temp: 298.150 k
press: 1.00000 atm
elementType: 7 7 6 6 6 6 6 6 6 6 6 1 1 1 1 1 1 1 1
symmnumber: 1
zpe: 392910.4 jmol-1
zpe.correction: 0.149652 hartree
zpe.thermalcorrener: 0.158008 hartree
zpe.thermalcorrenthalpy: 0.158952 hartree
zpe.thermalcorrgfe: 0.116729 hartree
zpe.sumelectzpe: -456.511846 hartree
zpe.sumelectthermal: -456.503491 hartree
zpe.sumelectthermalent: -456.502546 hartree
zpe.sumelectthermalfe: -456.544769 hartree
dipole: -1.4277 4.4727 0.0010
dipole: 4.6951
quadrupole: -48.8283 -58.7160 -69.8935
quadrupole: -4.0793 -0.0021 0.0026
quadrupole: 10.3176 0.4299 -10.7475 -4.0793 -0.0021 0.0026
hfenergy: -456.6614981 hartree
pointgroup: C01 [X(C9H8N2)]
dipole: 0.4480555 -1.7920169 0.0003806 debye
dipolederiv: -0.7907443 0.0514353 -0.0000153 -0.0303361 -0.4579688 0.0000156 -0.0000073 0.0000192 -0.2604201 -0.2937555 0.3420319 -0.0000481 0.5308505 -1.3062325 -0.0000381 0.000031 -0.0002078 -0.6981165 -0.1907128 0.3112264 -0.0000211 -0.0014246 -0.2607258 0.0000194 0.0000181 0.0000093 0.0261618 0.4234558 0.1606967 -0.0000097 0.2020188 0.1180949 -0.0000058 -0.0000167 -0.0000089 0.0472647 0.3410915 -0.2446245 0.0000372 -0.5953684 1.4411301 -0.0000799 0.0000676 -0.0000794 0.1364073 0.0148488 -0.0833747 -0.0000054 0.0643187 0.0348238 0.0000104 -0.0000221 0.0000279 -0.1739842 -0.1346216 -0.0882811 0.000002 -0.073006 0.1270742 -0.0000161 0.000007 -0.000013 -0.1483374 0.009609 -0.3060745 0.000037 0.1787035 -0.6600921 0.0000323 -0.0000243 0.0000578 -0.2193684 -0.0705629 0.1503186 0.0000008 0.0669326 0.0371893 -0.0000032 0.0000061 0.0000003 -0.1652355 0.1101803 -0.0893931 0.0000063 -0.0797526 0.0307976 -0.0000081 0.0000047 -0.0000149 -0.1628717 0.5074656 -0.0851588 0.0000165 -0.1490678 0.5698635 -0.0000496 0.0000139 -0.0000575 -0.0670856 0.0547979 0.0844297 -0.0000042 0.0183365 -0.148636 0.000008 -0.0000032 -0.0000061 0.1555516 0.0881143 0.0057096 -0.000001 0.0640767 -0.0506532 0.0000115 -0.0000007 0.0000124 0.1575505 -0.1372388 0.0506318 -0.00002 0.0937318 0.0563136 0.0000133 -0.0000257 0.0000175 0.1788783 -0.0386597 -0.1049436 -0.0000001 -0.1182077 -0.0165835 0.0000027 -0.0000021 0.0000029 0.1629467 -0.1254925 0.0656684 -0.0000073 0.0623231 0.0722465 0.0000043 -0.0000072 0.0000055 0.1605069 -0.0646807 -0.1207357 0.0000047 -0.1292729 -0.0142499 0.0000086 0.0000112 0.0000025 0.1251135 0.1465291 -0.0459841 0.0000375 -0.0553994 0.2254069 0.0000388 0.000012 0.0001457 0.3659506 0.1503767 -0.0535783 -0.0000099 -0.0494565 0.2022013 0.000036 -0.0000624 0.0000865 0.3790876 unknown
polarizability: 159.3835119|1.5127812|126.9210546|0.002504|-0.005512|44.3870926 unknown
InChI: InChI=1S/C9H8N2/c10-8-5-6-11-9-4-2-1-3-7(8)9/h1-6H,10H2
charge 0 multiplicity 1
19 atoms
N  0.648063 1.906436 -0.000063
N  1.796737 -2.220493 0.000271
C  0.003239 -0.516043 0.000076
C  -0.313324 0.900748 -0.000016
C  1.406748 -0.889851 0.00016
C  -1.069014 -1.46405 0.000091
C  -1.689534 1.299523 -0.000046
C  2.364136 0.147539 0.000105
C  -2.40271 -1.043735 0.000048
C  -2.714736 0.351015 -0.00001
C  1.937103 1.502973 -0.000013
H  -0.863309 -2.542154 0.000091
H  -1.894831 2.374576 -0.000103
H  3.435488 -0.083317 0.000167
H  -3.210984 -1.783255 0.000054
H  -3.761951 0.673531 -0.000038
H  2.689996 2.301179 -0.000056
H  1.120083 -2.976653 0.000577
H  2.7836 -2.46317 0.000406
