program: Orca
programVersion: 4.2.1
elementType: Cl Cl O O N N N C C C C C C C C C C C C C C C H H H H H H H H H H H H H H H H H
charge: 0
multiplicity: 1
keywords: wb97x-d3
keywords: def2-TZVPP
keywords: def2/J RIJCOSX GRIDX6 NOFINALGRIDX
keywords: grid4 nofinalgrid
keywords: scfconv7
keywords: smallprint printgap noloewdin
keywords: NOSOSCF
formula: C15H17Cl2N3O2
InChI: InChI=1/C15H17Cl2N3O2/c1-2-3-12-7-21-15(22-12,8-20-10-18-9-19-20)13-5-4-11(16)6-14(13)17/h4-6,9-10,12H,2-3,7-8H2,1H3
39 atoms
Cl 2.321041 -0.577556 -1.978326
Cl 0.636373 -5.380158 -0.413197
O  -0.992344 0.965449 0.680458
O  0.14417 1.279463 -1.212068
N  1.241261 2.589795 1.095976
N  0.737489 3.037508 2.249338
N  1.121918 4.745168 0.845896
C  0.19831 0.637682 0.025566
C  -1.971028 1.358912 -0.286406
C  -1.213014 1.241697 -1.60712
C  -3.211636 0.489705 -0.235908
C  1.382201 1.184545 0.826786
C  0.330803 -0.879514 -0.121138
C  -3.993505 0.549221 1.072315
C  1.240423 -1.492406 -0.981651
C  -0.461924 -1.713546 0.662371
C  -4.607318 1.911177 1.364937
C  1.340162 -2.872782 -1.07832
C  -0.384156 -3.093184 0.587247
C  1.453082 3.615873 0.26966
C  0.519337 -3.661653 -0.292409
C  0.691693 4.32817 2.052731
H  -2.227407 2.403928 -0.087412
H  -1.44596 0.302488 -2.123902
H  -1.407384 2.067926 -2.288322
H  -2.929126 -0.544998 -0.45211
H  -3.86068 0.805322 -1.059848
H  2.310748 1.017451 0.283171
H  1.463275 0.663288 1.778019
H  -3.352138 0.244829 1.903748
H  -4.791183 -0.195262 1.023024
H  -1.16642 -1.276129 1.354771
H  -5.185954 1.888535 2.289016
H  -3.853932 2.692247 1.478399
H  -5.281644 2.219384 0.563368
H  2.050974 -3.321327 -1.758112
H  -1.022039 -3.708111 1.206163
H  1.863301 3.504029 -0.720803
H  0.339006 5.001822 2.817654
elementType: Cl O N C H
totalener: -1817.03437215 hartree
nucrepener: 2168.80464773 hartree
electener: -3985.83901988 hartree
oneelecener: -6802.82002368 hartree
twoeener: 2816.98100381 hartree
cpcmener: -0.02709872 hartree
kineticenergy: 1811.93389256 hartree
xcener: -128.820118732368 hartree
chargesum: -0.0000000
charge: -0.074020 -0.083136 -0.389723 -0.369923 0.126687 -0.354889 -0.421145 0.589153 0.124140 0.005973 -0.195557 -0.109795 -0.100268 -0.095828 -0.014602 -0.187631 -0.277667 -0.150765 -0.176504 0.070715 0.114805 0.055112 0.098705 0.088671 0.118229 0.084006 0.094353 0.147171 0.132890 0.060557 0.072831 0.165182 0.093260 0.079507 0.083000 0.121687 0.146409 0.165278 0.163131
qa: -0.0740 -0.0831 -0.3897 -0.3699 0.1267 -0.3549 -0.4211 0.5892 0.1241 0.0060 -0.1956 -0.1098 -0.1003 -0.0958 -0.0146 -0.1876 -0.2777 -0.1508 -0.1765 0.0707 0.1148 0.0551 0.0987 0.0887 0.1182 0.0840 0.0944 0.1472 0.1329 0.0606 0.0728 0.1652 0.0933 0.0795 0.0830 0.1217 0.1464 0.1653 0.1631
va: 1.2472 1.2211 1.9859 1.9865 3.3747 2.8914 3.0278 3.8723 3.8899 3.9343 3.9527 3.7880 3.5073 3.8737 4.0070 3.9628 3.9324 4.0812 4.0579 4.0713 3.8568 4.0562 0.9948 1.0056 0.9962 1.0058 1.0111 1.0161 1.0197 1.0167 1.0077 1.0092 1.0036 1.0003 1.0001 1.0261 1.0068 1.0069 0.9948
dispcorr: -0.022031823 hartree
energy: -1817.056403972666
dipole: -30.76397 29.72760 -1.03636 20.87967 -22.16545 -1.28578 9.09492 -9.86052 -0.76560
magnitude: 1.82028 au
magnitude: 4.62679 debye
