program: Orca
programVersion: 4.2.1
elementType: Cl Cl O O N N N C C C C C C C C C C C C C C C H H H H H H H H H H H H H H H H H
charge: 0
multiplicity: 1
keywords: wb97x-d3
keywords: def2-TZVPP
keywords: def2/J RIJCOSX GRIDX6 NOFINALGRIDX
keywords: grid4 nofinalgrid
keywords: scfconv7
keywords: smallprint printgap noloewdin
keywords: NOSOSCF
formula: C15H17Cl2N3O2
InChI: InChI=1/C15H17Cl2N3O2/c1-2-3-12-7-21-15(22-12,8-20-10-18-9-19-20)13-5-4-11(16)6-14(13)17/h4-6,9-10,12H,2-3,7-8H2,1H3
39 atoms
Cl 2.506363 -0.530129 -1.796655
Cl 0.897876 -5.446481 -0.533109
O  -1.068605 0.777733 0.636009
O  0.131211 1.169935 -1.217842
N  1.00705 2.5548 1.104926
N  0.323885 2.986136 2.169686
N  0.686743 4.673098 0.734178
C  0.164465 0.530905 0.02474
C  -1.952727 1.411789 -0.288876
C  -1.228195 1.221868 -1.610446
C  -3.329355 0.786292 -0.237265
C  1.268922 1.156681 0.885141
C  0.379803 -0.973667 -0.128396
C  -4.031129 0.897904 1.112882
C  1.386945 -1.521287 -0.922082
C  -0.44839 -1.863636 0.549192
C  -4.282148 2.329236 1.564807
C  1.552614 -2.892004 -1.053044
C  -0.30366 -3.23623 0.440539
C  1.201282 3.566884 0.257087
C  0.698948 -3.738705 -0.368773
C  0.163663 4.254738 1.903027
H  -2.005749 2.479419 -0.043306
H  -1.531888 0.294331 -2.111444
H  -1.364501 2.05236 -2.300794
H  -3.25182 -0.266075 -0.526671
H  -3.939332 1.274449 -1.004258
H  2.244179 1.046357 0.414851
H  1.312413 0.66017 1.852561
H  -3.455099 0.366271 1.87459
H  -4.98609 0.372574 1.040553
H  -1.236941 -1.481377 1.180689
H  -4.877866 2.350657 2.478064
H  -3.355239 2.865408 1.77513
H  -4.825303 2.895789 0.805465
H  2.336582 -3.288476 -1.682774
H  -0.969395 -3.896421 0.978217
H  1.737661 3.463395 -0.672114
H  -0.348783 4.913223 2.586738
elementType: Cl O N C H
totalener: -1817.03466538 hartree
nucrepener: 2174.20506569 hartree
electener: -3991.23973108 hartree
oneelecener: -6813.74035694 hartree
twoeener: 2822.50062587 hartree
cpcmener: -0.02615361 hartree
kineticenergy: 1811.93821955 hartree
xcener: -128.820354541329 hartree
chargesum: -0.0000000
charge: -0.075727 -0.083752 -0.385983 -0.373764 0.122279 -0.347808 -0.414213 0.571334 0.094067 0.030577 -0.176461 -0.113190 -0.086333 -0.090740 -0.013049 -0.154673 -0.279569 -0.153859 -0.182762 0.062072 0.116758 0.053200 0.089828 0.084941 0.120852 0.075094 0.090365 0.146740 0.129807 0.062019 0.073730 0.159353 0.095019 0.074720 0.084295 0.121893 0.146616 0.164840 0.161484
qa: -0.0757 -0.0838 -0.3860 -0.3738 0.1223 -0.3478 -0.4142 0.5713 0.0941 0.0306 -0.1765 -0.1132 -0.0863 -0.0907 -0.0130 -0.1547 -0.2796 -0.1539 -0.1828 0.0621 0.1168 0.0532 0.0898 0.0849 0.1209 0.0751 0.0904 0.1467 0.1298 0.0620 0.0737 0.1594 0.0950 0.0747 0.0843 0.1219 0.1466 0.1648 0.1615
va: 1.2452 1.2204 1.9864 1.9834 3.3841 2.8902 3.0268 3.8870 3.9188 3.9306 3.9581 3.8012 3.5183 3.8651 4.0045 3.9524 3.9326 4.0868 4.0546 4.0738 3.8521 4.0485 0.9916 1.0089 0.9964 1.0139 1.0102 1.0183 1.0214 1.0155 1.0080 1.0127 1.0040 1.0015 1.0008 1.0260 1.0068 1.0075 0.9966
dispcorr: -0.022419170 hartree
energy: -1817.057084555314
dipole: -31.32630 30.43917 -0.88713 23.14496 -24.24222 -1.09726 9.51090 -10.18906 -0.67817
magnitude: 1.56553 au
magnitude: 3.97927 debye
