program: Orca
programVersion: 4.2.1
elementType: Cl Cl O O N N N C C C C C C C C C C C C C C C H H H H H H H H H H H H H H H H H
charge: 0
multiplicity: 1
keywords: wb97x-d3
keywords: def2-TZVPP
keywords: def2/J RIJCOSX GRIDX6 NOFINALGRIDX
keywords: grid4 nofinalgrid
keywords: scfconv7
keywords: smallprint printgap noloewdin
keywords: NOSOSCF
formula: C15H17Cl2N3O2
InChI: InChI=1/C15H17Cl2N3O2/c1-2-3-12-7-21-15(22-12,8-20-10-18-9-19-20)13-5-4-11(16)6-14(13)17/h4-6,9-10,12H,2-3,7-8H2,1H3
39 atoms
Cl -0.802588 -0.652287 2.389556
Cl 2.090384 -4.125493 -0.425476
O  -1.904277 1.255926 0.392753
O  -0.632297 1.831339 -1.372534
N  1.617838 2.189695 0.491995
N  2.482346 1.392577 1.127806
N  3.468867 2.373037 -0.632619
C  -0.590674 1.282523 -0.080351
C  -2.787253 1.335972 -0.725057
C  -1.972566 2.189673 -1.682143
C  -3.154191 -0.029455 -1.286861
C  0.220053 2.212869 0.838671
C  0.046119 -0.102451 -0.15332
C  -3.780885 -0.984026 -0.276355
C  0.004947 -1.012102 0.900297
C  0.762985 -0.476003 -1.286301
C  -5.116592 -0.505032 0.276788
C  0.62064 -2.252112 0.823864
C  1.398605 -1.701555 -1.386378
C  2.216054 2.751098 -0.560734
C  1.315188 -2.58439 -0.325274
C  3.571246 1.540493 0.421031
H  -3.680667 1.863873 -0.387551
H  -2.165335 1.968827 -2.732445
H  -2.136188 3.257942 -1.513271
H  -2.272235 -0.497877 -1.734509
H  -3.855777 0.140373 -2.109838
H  0.129405 1.916776 1.880773
H  -0.159209 3.230797 0.745665
H  -3.084631 -1.162604 0.546323
H  -3.922805 -1.95067 -0.765442
H  0.832759 0.203641 -2.122845
H  -5.569745 -1.264525 0.915612
H  -5.015917 0.400753 0.877774
H  -5.822495 -0.289515 -0.528526
H  0.562801 -2.942183 1.654013
H  1.947229 -1.956913 -2.281929
H  1.718329 3.437931 -1.225654
H  4.485273 1.030764 0.682215
elementType: Cl O N C H
totalener: -1817.03266267 hartree
nucrepener: 2237.00951952 hartree
electener: -4054.04218219 hartree
oneelecener: -6940.00615446 hartree
twoeener: 2885.96397227 hartree
cpcmener: -0.02725529 hartree
kineticenergy: 1811.92425317 hartree
xcener: -128.820088677451 hartree
chargesum: -0.0000000
charge: -0.081928 -0.085921 -0.382039 -0.400544 0.113061 -0.337416 -0.409578 0.546674 0.178100 0.007948 -0.198135 -0.112178 -0.057372 -0.110905 -0.030418 -0.168621 -0.281865 -0.127228 -0.173330 0.060582 0.109106 0.057256 0.116337 0.096628 0.094155 0.087663 0.090406 0.129887 0.131885 0.056162 0.074942 0.149048 0.093324 0.081485 0.084304 0.119534 0.148094 0.169446 0.161450
qa: -0.0819 -0.0859 -0.3820 -0.4005 0.1131 -0.3374 -0.4096 0.5467 0.1781 0.0079 -0.1981 -0.1122 -0.0574 -0.1109 -0.0304 -0.1686 -0.2819 -0.1272 -0.1733 0.0606 0.1091 0.0573 0.1163 0.0966 0.0942 0.0877 0.0904 0.1299 0.1319 0.0562 0.0749 0.1490 0.0933 0.0815 0.0843 0.1195 0.1481 0.1694 0.1615
va: 1.2346 1.2180 2.0010 1.9657 3.3606 2.8861 3.0335 3.8937 3.8672 4.0041 3.9256 3.8768 3.4833 3.8828 3.9421 3.8855 3.9354 4.0863 4.0537 4.0724 3.8541 4.0463 0.9870 0.9915 0.9979 1.0041 1.0110 1.0259 1.0106 1.0278 1.0100 1.0262 1.0040 0.9983 0.9999 1.0249 1.0038 1.0071 0.9964
dispcorr: -0.024343742 hartree
energy: -1817.057006409128
dipole: -27.83949 25.50246 -2.33704 13.77687 -12.76631 1.01056 -10.45982 9.31776 -1.14206
magnitude: 2.79057 au
magnitude: 7.09307 debye
