program: Orca
programVersion: 4.2.1
elementType: Cl Cl O O N N N C C C C C C C C C C C C C C C H H H H H H H H H H H H H H H H H
charge: 0
multiplicity: 1
keywords: wb97x-d3
keywords: def2-TZVPP
keywords: def2/J RIJCOSX GRIDX6 NOFINALGRIDX
keywords: grid4 nofinalgrid
keywords: scfconv7
keywords: smallprint printgap noloewdin
keywords: NOSOSCF
formula: C15H17Cl2N3O2
InChI: InChI=1/C15H17Cl2N3O2/c1-2-3-12-7-21-15(22-12,8-20-10-18-9-19-20)13-5-4-11(16)6-14(13)17/h4-6,9-10,12H,2-3,7-8H2,1H3
39 atoms
Cl 0.023215 -0.963366 2.158551
Cl 0.256428 -5.166376 -1.104365
O  -0.566402 1.316203 0.346742
O  0.450527 1.462138 -1.622211
N  1.847695 2.661929 0.583087
N  1.560724 3.106975 1.80534
N  1.907104 4.821978 0.411028
C  0.516774 0.833788 -0.376974
C  -1.626889 1.604264 -0.560319
C  -0.91452 1.698805 -1.918991
C  -2.723868 0.554703 -0.539616
C  1.832489 1.255581 0.281112
C  0.469625 -0.687653 -0.527434
C  -3.430942 0.416609 0.801072
C  0.231295 -1.549071 0.54298
C  0.67384 -1.267119 -1.775615
C  -4.486917 -0.677466 0.781054
C  0.163825 -2.923565 0.374954
C  0.613712 -2.636609 -1.972788
C  2.044202 3.693509 -0.241729
C  0.349585 -3.454791 -0.889313
C  1.611576 4.4045 1.657363
H  -2.041426 2.571636 -0.263375
H  -1.295152 0.956243 -2.628351
H  -1.003326 2.684249 -2.37642
H  -2.314635 -0.413508 -0.847861
H  -3.4524 0.833185 -1.309197
H  2.655816 1.016234 -0.392173
H  2.004566 0.7184 1.210407
H  -3.893825 1.371229 1.06974
H  -2.699718 0.198131 1.582218
H  0.882355 -0.635903 -2.628209
H  -4.042736 -1.651607 0.565324
H  -4.99754 -0.757462 1.741804
H  -5.247605 -0.488962 0.020558
H  -0.030409 -3.566974 1.221948
H  0.769201 -3.051266 -2.959002
H  2.292903 3.578284 -1.284293
H  1.434862 5.078517 2.481345
elementType: Cl O N C H
totalener: -1817.04441291 hartree
nucrepener: 2195.18073638 hartree
electener: -4012.22514929 hartree
oneelecener: -6855.77082631 hartree
twoeener: 2843.54567702 hartree
cpcmener: -0.02538067 hartree
kineticenergy: 1811.93203898 hartree
xcener: -128.819237822508 hartree
chargesum: -0.0000000
charge: -0.074908 -0.081410 -0.365215 -0.384846 0.122495 -0.345936 -0.415636 0.577138 0.243696 -0.050812 -0.223390 -0.104334 -0.156627 -0.093783 -0.019744 -0.122047 -0.277917 -0.145978 -0.189367 0.065230 0.116431 0.054963 0.101564 0.098722 0.106597 0.068299 0.093131 0.143699 0.135029 0.066244 0.063010 0.152008 0.077886 0.091741 0.079460 0.121640 0.146188 0.166668 0.160112
qa: -0.0749 -0.0814 -0.3652 -0.3848 0.1225 -0.3459 -0.4156 0.5771 0.2437 -0.0508 -0.2234 -0.1043 -0.1566 -0.0938 -0.0197 -0.1220 -0.2779 -0.1460 -0.1894 0.0652 0.1164 0.0550 0.1016 0.0987 0.1066 0.0683 0.0931 0.1437 0.1350 0.0662 0.0630 0.1520 0.0779 0.0917 0.0795 0.1216 0.1462 0.1667 0.1601
va: 1.2427 1.2228 2.0111 1.9802 3.3685 2.8862 3.0302 3.8646 3.7949 3.9552 3.9451 3.7711 3.5441 3.8550 3.9857 3.9306 3.9438 4.0838 4.0562 4.0691 3.8618 4.0596 0.9953 0.9968 1.0013 0.9989 1.0134 1.0078 1.0310 1.0088 1.0261 1.0194 1.0013 1.0042 1.0014 1.0258 1.0067 1.0052 0.9955
dispcorr: -0.022761676 hartree
energy: -1817.067174587487
dipole: -20.23218 19.62726 -0.60492 16.27702 -17.30731 -1.03029 -5.87571 4.01525 -1.86045
magnitude: 2.21104 au
magnitude: 5.62003 debye
