program: Orca
programVersion: 4.2.1
elementType: Cl Cl O O N N N C C C C C C C C C C C C C C C H H H H H H H H H H H H H H H H H
charge: 0
multiplicity: 1
keywords: wb97x-d3
keywords: def2-TZVPP
keywords: def2/J RIJCOSX GRIDX6 NOFINALGRIDX
keywords: grid4 nofinalgrid
keywords: scfconv7
keywords: smallprint printgap noloewdin
keywords: NOSOSCF
formula: C15H17Cl2N3O2
InChI: InChI=1/C15H17Cl2N3O2/c1-2-3-12-7-21-15(22-12,8-20-10-18-9-19-20)13-5-4-11(16)6-14(13)17/h4-6,9-10,12H,2-3,7-8H2,1H3
39 atoms
Cl 0.028045 -0.98722 2.196866
Cl 0.214552 -5.163025 -1.105145
O  -0.574407 1.318154 0.385513
O  0.465697 1.462173 -1.576295
N  1.870725 2.664313 0.570393
N  1.512188 3.194906 1.741248
N  2.033058 4.807258 0.278199
C  0.510944 0.830666 -0.331001
C  -1.621346 1.623004 -0.529256
C  -0.874572 1.832919 -1.854911
C  -2.68326 0.538013 -0.601812
C  1.821129 1.245055 0.346134
C  0.456741 -0.690017 -0.49069
C  -3.395907 0.282617 0.719054
C  0.225218 -1.559869 0.574233
C  0.643693 -1.260273 -1.746157
C  -4.441605 -0.815977 0.607818
C  0.148248 -2.932609 0.395191
C  0.573444 -2.627401 -1.954443
C  2.171831 3.636713 -0.294745
C  0.316895 -3.453982 -0.875535
C  1.626179 4.478279 1.521009
H  -2.07906 2.553533 -0.183491
H  -1.287599 1.217718 -2.660157
H  -0.886102 2.873733 -2.181675
H  -2.243453 -0.393207 -0.974786
H  -3.413171 0.851275 -1.356135
H  2.657165 0.947292 -0.286622
H  1.945221 0.752691 1.307256
H  -3.870227 1.207637 1.061692
H  -2.666064 0.010374 1.484233
H  0.845087 -0.622289 -2.595093
H  -3.991512 -1.762234 0.300013
H  -4.941127 -0.987735 1.562403
H  -5.211692 -0.565504 -0.124675
H  -0.039838 -3.582459 1.238573
H  0.714715 -3.034259 -2.946057
H  2.493316 3.448661 -1.306606
H  1.418302 5.207555 2.288797
elementType: Cl O N C H
totalener: -1817.04412725 hartree
nucrepener: 2196.32972241 hartree
electener: -4013.37384967 hartree
oneelecener: -6858.07216447 hartree
twoeener: 2844.69831480 hartree
cpcmener: -0.02520047 hartree
kineticenergy: 1811.91717724 hartree
xcener: -128.817084959670 hartree
chargesum: -0.0000000
charge: -0.076688 -0.081270 -0.364554 -0.390234 0.120178 -0.345898 -0.415786 0.570952 0.246610 -0.046158 -0.226010 -0.102545 -0.146503 -0.095803 -0.019507 -0.127070 -0.278790 -0.146084 -0.183280 0.063616 0.114422 0.055868 0.102864 0.100497 0.103783 0.071560 0.092216 0.142404 0.135163 0.066713 0.063087 0.150290 0.078042 0.091665 0.080107 0.121684 0.146138 0.168287 0.160030
qa: -0.0767 -0.0813 -0.3646 -0.3902 0.1202 -0.3459 -0.4158 0.5710 0.2466 -0.0462 -0.2260 -0.1025 -0.1465 -0.0958 -0.0195 -0.1271 -0.2788 -0.1461 -0.1833 0.0636 0.1144 0.0559 0.1029 0.1005 0.1038 0.0716 0.0922 0.1424 0.1352 0.0667 0.0631 0.1503 0.0780 0.0917 0.0801 0.1217 0.1461 0.1683 0.1600
va: 1.2404 1.2229 2.0128 1.9748 3.3727 2.8880 3.0297 3.8748 3.7987 3.9591 3.9403 3.7729 3.5450 3.8572 3.9835 3.9347 3.9452 4.0837 4.0510 4.0660 3.8652 4.0560 0.9943 0.9961 1.0000 0.9991 1.0135 1.0070 1.0335 1.0090 1.0272 1.0222 1.0012 1.0041 1.0015 1.0258 1.0065 1.0036 0.9956
dispcorr: -0.022906636 hartree
energy: -1817.067033888945
dipole: -19.88147 19.27802 -0.60346 16.06992 -17.08920 -1.01928 -6.36429 4.60955 -1.75474
magnitude: 2.11712 au
magnitude: 5.38130 debye
