program: Orca
programVersion: 4.2.1
elementType: Cl Cl O O N N N C C C C C C C C C C C C C C C H H H H H H H H H H H H H H H H H
charge: 0
multiplicity: 1
keywords: wb97x-d3
keywords: def2-TZVPP
keywords: def2/J RIJCOSX GRIDX6 NOFINALGRIDX
keywords: grid4 nofinalgrid
keywords: scfconv7
keywords: smallprint printgap noloewdin
keywords: NOSOSCF
formula: C15H17Cl2N3O2
InChI: InChI=1/C15H17Cl2N3O2/c1-2-3-12-7-21-15(22-12,8-20-10-18-9-19-20)13-5-4-11(16)6-14(13)17/h4-6,9-10,12H,2-3,7-8H2,1H3
39 atoms
Cl -0.425879 -0.45563 2.70961
Cl 1.966547 -4.232405 -0.188442
O  -1.839738 1.224123 0.719579
O  -0.828894 1.648403 -1.242884
N  1.660744 2.187552 0.260697
N  2.596024 1.425424 0.832686
N  3.38121 2.343735 -1.051344
C  -0.600759 1.228404 0.06898
C  -2.851237 1.749547 -0.1397
C  -2.032668 2.392806 -1.251453
C  -3.835015 0.676164 -0.577071
C  0.321068 2.23928 0.784705
C  0.025056 -0.156498 0.02861
C  -3.266762 -0.504324 -1.355726
C  0.14409 -0.964436 1.156331
C  0.544717 -0.647508 -1.16504
C  -4.357705 -1.495647 -1.735064
C  0.733816 -2.218072 1.098634
C  1.14673 -1.890883 -1.249421
C  2.139179 2.721251 -0.867188
C  1.230407 -2.670513 -0.11043
C  3.609027 1.551026 0.015099
H  -3.40096 2.512984 0.417393
H  -2.486316 2.313082 -2.239425
H  -1.843811 3.453008 -1.048356
H  -4.606162 1.174278 -1.174525
H  -4.347781 0.301601 0.314709
H  0.371605 2.038883 1.851992
H  -0.075588 3.248114 0.658508
H  -2.511709 -1.016732 -0.755112
H  -2.760666 -0.162742 -2.262788
H  0.480185 -0.051533 -2.063337
H  -5.112089 -1.034937 -2.376337
H  -3.949843 -2.352758 -2.272565
H  -4.870328 -1.878561 -0.850041
H  0.804058 -2.828648 1.987993
H  1.538668 -2.240851 -2.194233
H  1.563511 3.376158 -1.501968
H  4.550926 1.056684 0.196437
elementType: Cl O N C H
totalener: -1817.04169621 hartree
nucrepener: 2226.54524781 hartree
electener: -4043.58694402 hartree
oneelecener: -6919.05294497 hartree
twoeener: 2875.46600095 hartree
cpcmener: -0.02507448 hartree
kineticenergy: 1811.90903186 hartree
xcener: -128.816129340941 hartree
chargesum: 0.0000000
charge: -0.072083 -0.085044 -0.383415 -0.385115 0.123423 -0.335288 -0.405366 0.556855 0.182946 -0.010614 -0.185023 -0.155033 -0.130897 -0.062657 0.046609 -0.131764 -0.290585 -0.151288 -0.180965 0.059959 0.122884 0.058340 0.098201 0.102424 0.095308 0.072026 0.071594 0.133023 0.130476 0.059507 0.062410 0.143659 0.082410 0.091848 0.080045 0.118306 0.145165 0.167395 0.160324
qa: -0.0721 -0.0850 -0.3834 -0.3851 0.1234 -0.3353 -0.4054 0.5569 0.1829 -0.0106 -0.1850 -0.1550 -0.1309 -0.0627 0.0466 -0.1318 -0.2906 -0.1513 -0.1810 0.0600 0.1229 0.0583 0.0982 0.1024 0.0953 0.0720 0.0716 0.1330 0.1305 0.0595 0.0624 0.1437 0.0824 0.0918 0.0800 0.1183 0.1452 0.1674 0.1603
va: 1.2488 1.2190 2.0261 1.9599 3.3416 2.8821 3.0371 3.8644 3.9044 3.9604 3.9376 3.9431 3.4688 3.8626 3.9371 3.8582 3.9468 4.1122 4.0671 4.0738 3.8487 4.0451 0.9953 0.9954 0.9990 1.0101 1.0129 1.0286 1.0019 1.0081 1.0123 1.0285 1.0002 1.0029 1.0003 1.0266 1.0053 1.0029 0.9964
dispcorr: -0.023847364 hartree
energy: -1817.065543571342
dipole: -27.36000 25.04725 -2.31275 13.96919 -12.57125 1.39793 -16.05663 15.26912 -0.78752
magnitude: 2.81482 au
magnitude: 7.15471 debye
