program: Orca
programVersion: 4.2.1
elementType: Cl Cl O O N N N C C C C C C C C C C C C C C C H H H H H H H H H H H H H H H H H
charge: 0
multiplicity: 1
keywords: wb97x-d3
keywords: def2-TZVPP
keywords: def2/J RIJCOSX GRIDX6 NOFINALGRIDX
keywords: grid4 nofinalgrid
keywords: scfconv7
keywords: smallprint printgap noloewdin
keywords: NOSOSCF
formula: C15H17Cl2N3O2
InChI: InChI=1/C15H17Cl2N3O2/c1-2-3-12-7-21-15(22-12,8-20-10-18-9-19-20)13-5-4-11(16)6-14(13)17/h4-6,9-10,12H,2-3,7-8H2,1H3
39 atoms
Cl -0.744076 -0.564919 2.471075
Cl 1.659843 -4.238124 -0.542685
O  -1.781124 1.447513 0.533482
O  -0.537509 1.965405 -1.264381
N  1.78991 2.195065 0.491534
N  2.231233 2.947936 -0.518057
N  3.858597 1.599228 0.221779
C  -0.48951 1.390586 0.010475
C  -2.697749 1.605501 -0.547654
C  -1.858867 2.410766 -1.527136
C  -3.187073 0.278925 -1.108123
C  0.418646 2.23279 0.92472
C  0.029417 -0.042236 -0.106404
C  -3.859342 -0.61808 -0.077132
C  -0.045135 -0.965242 0.935439
C  0.649311 -0.461498 -1.280332
C  -4.231802 -1.97598 -0.652052
C  0.447716 -2.255735 0.809783
C  1.155103 -1.740828 -1.431705
C  2.768725 1.390303 0.917121
C  1.043704 -2.632411 -0.380092
C  3.473912 2.560119 -0.641994
H  -3.541739 2.184377 -0.165704
H  -2.100177 2.210246 -2.571993
H  -1.946113 3.487323 -1.350692
H  -2.360487 -0.258098 -1.585468
H  -3.897687 0.509255 -1.90839
H  0.376999 1.869378 1.949939
H  0.075977 3.267415 0.925545
H  -4.755651 -0.121678 0.307664
H  -3.197455 -0.760704 0.779558
H  0.740189 0.226478 -2.108357
H  -4.896613 -1.881603 -1.513144
H  -3.34446 -2.52102 -0.981109
H  -4.739695 -2.595942 0.088097
H  0.368024 -2.952056 1.63314
H  1.628458 -2.030848 -2.359343
H  2.645125 0.692031 1.730662
H  4.133129 2.992329 -1.378863
elementType: Cl O N C H
totalener: -1817.04238568 hartree
nucrepener: 2230.71379697 hartree
electener: -4047.75618266 hartree
oneelecener: -6927.02051499 hartree
twoeener: 2879.26433234 hartree
cpcmener: -0.02477286 hartree
kineticenergy: 1811.91292056 hartree
xcener: -128.817023949350 hartree
chargesum: -0.0000000
charge: -0.078170 -0.081559 -0.374726 -0.384553 0.130025 -0.346211 -0.400866 0.558996 0.201280 0.004571 -0.216651 -0.138180 -0.086506 -0.097204 -0.057632 -0.151450 -0.278201 -0.110720 -0.156319 0.056793 0.103228 0.060786 0.109283 0.093330 0.091361 0.076697 0.091491 0.142711 0.119904 0.070329 0.059703 0.143873 0.081148 0.077547 0.092002 0.119870 0.146945 0.166109 0.160965
qa: -0.0782 -0.0816 -0.3747 -0.3846 0.1300 -0.3462 -0.4009 0.5590 0.2013 0.0046 -0.2167 -0.1382 -0.0865 -0.0972 -0.0576 -0.1514 -0.2782 -0.1107 -0.1563 0.0568 0.1032 0.0608 0.1093 0.0933 0.0914 0.0767 0.0915 0.1427 0.1199 0.0703 0.0597 0.1439 0.0811 0.0775 0.0920 0.1199 0.1469 0.1661 0.1610
va: 1.2368 1.2223 2.0145 1.9836 3.3354 2.8947 3.0345 3.8867 3.8835 4.0018 3.9335 3.8978 3.4743 3.8657 3.9448 3.8805 3.9469 4.0634 4.0425 4.0722 3.8749 4.0504 0.9929 0.9912 0.9961 0.9980 1.0127 1.0118 1.0226 1.0083 1.0251 1.0327 1.0013 1.0008 1.0037 1.0246 1.0039 0.9962 0.9957
dispcorr: -0.024081364 hartree
energy: -1817.066467048451
dipole: -24.65640 22.59172 -2.06468 10.69134 -10.41985 0.27148 -10.61645 10.38770 -0.22875
magnitude: 2.09498 au
magnitude: 5.32502 debye
