program: Orca
programVersion: 4.2.1
elementType: Cl Cl O O N N N C C C C C C C C C C C C C C C H H H H H H H H H H H H H H H H H
charge: 0
multiplicity: 1
keywords: wb97x-d3
keywords: def2-TZVPP
keywords: def2/J RIJCOSX GRIDX6 NOFINALGRIDX
keywords: grid4 nofinalgrid
keywords: scfconv7
keywords: smallprint printgap noloewdin
keywords: NOSOSCF
formula: C15H17Cl2N3O2
InChI: InChI=1/C15H17Cl2N3O2/c1-2-3-12-7-21-15(22-12,8-20-10-18-9-19-20)13-5-4-11(16)6-14(13)17/h4-6,9-10,12H,2-3,7-8H2,1H3
39 atoms
Cl -0.668097 -0.379075 2.354323
Cl 1.760789 -4.11313 -0.568951
O  -1.810765 1.491121 0.314602
O  -0.598553 2.031655 -1.463748
N  1.747864 2.190895 0.52404
N  2.37289 2.500781 -0.611796
N  3.779838 1.490614 0.807504
C  -0.509133 1.483861 -0.183759
C  -2.709288 1.300353 -0.777202
C  -1.842562 1.620163 -2.006623
C  -3.301441 -0.096571 -0.813948
C  0.338031 2.412648 0.696752
C  0.072304 0.068829 -0.241623
C  -4.145716 -0.449045 0.402394
C  0.01488 -0.825611 0.825191
C  0.714628 -0.365419 -1.397157
C  -4.717114 -1.855403 0.316554
C  0.528372 -2.110321 0.735589
C  1.23938 -1.641102 -1.515907
C  2.593594 1.57875 1.355966
C  1.131034 -2.50899 -0.444595
C  3.587636 2.06626 -0.395017
H  -3.511565 2.033948 -0.657473
H  -1.722427 0.744271 -2.654031
H  -2.242711 2.436418 -2.607979
H  -2.501656 -0.83407 -0.94171
H  -3.919078 -0.161059 -1.716735
H  0.102665 2.247619 1.745794
H  0.099215 3.449998 0.462713
H  -4.962015 0.273004 0.502614
H  -3.542777 -0.358857 1.30844
H  0.81114 0.30639 -2.238174
H  -5.326619 -2.092065 1.189945
H  -5.347593 -1.979911 -0.566175
H  -3.923575 -2.603253 0.260039
H  0.46105 -2.785404 1.577477
H  1.724417 -1.945372 -2.433025
H  2.306059 1.231807 2.336198
H  4.368764 2.170875 -1.131693
elementType: Cl O N C H
totalener: -1817.04290263 hartree
nucrepener: 2236.12211055 hartree
electener: -4053.16501318 hartree
oneelecener: -6937.85476041 hartree
twoeener: 2884.68974723 hartree
cpcmener: -0.02511901 hartree
kineticenergy: 1811.92562423 hartree
xcener: -128.818578592005 hartree
chargesum: 0.0000000
charge: -0.073534 -0.081638 -0.369010 -0.373680 0.129599 -0.349234 -0.400659 0.618831 0.232666 -0.057435 -0.225629 -0.143202 -0.151997 -0.087408 -0.055498 -0.148433 -0.277538 -0.106789 -0.165910 0.078190 0.099296 0.061881 0.100034 0.095154 0.108870 0.069712 0.093211 0.140970 0.123535 0.064503 0.060625 0.149756 0.091617 0.079264 0.078068 0.120783 0.146869 0.164569 0.159594
qa: -0.0735 -0.0816 -0.3690 -0.3737 0.1296 -0.3492 -0.4007 0.6188 0.2327 -0.0574 -0.2256 -0.1432 -0.1520 -0.0874 -0.0555 -0.1484 -0.2775 -0.1068 -0.1659 0.0782 0.0993 0.0619 0.1000 0.0952 0.1089 0.0697 0.0932 0.1410 0.1235 0.0645 0.0606 0.1498 0.0916 0.0793 0.0781 0.1208 0.1469 0.1646 0.1596
va: 1.2426 1.2226 2.0202 1.9896 3.3515 2.8825 3.0369 3.7676 3.8127 3.9753 3.9404 3.8761 3.5085 3.8564 3.9839 3.8846 3.9451 4.0561 4.0514 4.0452 3.8785 4.0490 0.9970 0.9941 0.9995 0.9987 1.0139 1.0073 1.0291 1.0082 1.0250 1.0262 1.0040 1.0019 1.0010 1.0234 1.0045 1.0013 0.9958
dispcorr: -0.024087492 hartree
energy: -1817.066990127192
dipole: -26.88390 24.86100 -2.02290 8.35161 -8.27241 0.07920 -7.94135 7.48124 -0.46012
magnitude: 2.07607 au
magnitude: 5.27696 debye
