program: Orca
programVersion: 4.2.1
elementType: Cl Cl O O N N N C C C C C C C C C C C C C C C H H H H H H H H H H H H H H H H H
charge: 0
multiplicity: 1
keywords: wb97x-d3
keywords: def2-TZVPP
keywords: def2/J RIJCOSX GRIDX6 NOFINALGRIDX
keywords: grid4 nofinalgrid
keywords: scfconv7
keywords: smallprint printgap noloewdin
keywords: NOSOSCF
formula: C15H17Cl2N3O2
InChI: InChI=1/C15H17Cl2N3O2/c1-2-3-12-7-21-15(22-12,8-20-10-18-9-19-20)13-5-4-11(16)6-14(13)17/h4-6,9-10,12H,2-3,7-8H2,1H3
39 atoms
Cl 0.505891 -1.270612 2.352692
Cl 1.342304 -5.351748 -0.970112
O  -0.769215 0.771524 0.660888
O  -0.035457 1.142553 -1.42591
N  1.368755 2.661673 0.467752
N  0.934833 3.163914 1.625921
N  1.078723 4.776023 0.077893
C  0.303322 0.555808 -0.204752
C  -1.787246 1.528803 0.010722
C  -1.440492 1.320681 -1.455836
C  -3.146175 1.023247 0.4612
C  1.581231 1.250544 0.288207
C  0.554452 -0.941691 -0.362925
C  -4.303052 1.969112 0.155115
C  0.654053 -1.817876 0.71692
C  0.724032 -1.478247 -1.635284
C  -4.585683 2.20095 -1.3222
C  0.896496 -3.171859 0.539761
C  0.962503 -2.826615 -1.841753
C  1.443448 3.632132 -0.447482
C  1.044388 -3.664754 -0.7447
C  0.778665 4.432096 1.346952
H  -1.682038 2.587974 0.283662
H  -1.942431 0.438239 -1.871357
H  -1.659235 2.178925 -2.088764
H  -3.104715 0.876877 1.543385
H  -3.335236 0.038568 0.021514
H  2.378095 1.103176 -0.441118
H  1.917555 0.833501 1.234657
H  -4.122288 2.929561 0.646446
H  -5.19997 1.558188 0.624702
H  0.668306 -0.830781 -2.498887
H  -5.50447 2.774916 -1.452908
H  -3.792878 2.764951 -1.815947
H  -4.712235 1.260059 -1.861522
H  0.96701 -3.829321 1.395188
H  1.083085 -3.208478 -2.845864
H  1.774259 3.46197 -1.459669
H  0.439684 5.139258 2.088258
elementType: Cl O N C H
totalener: -1817.04328200 hartree
nucrepener: 2162.13870842 hartree
electener: -3979.18199042 hartree
oneelecener: -6789.74114704 hartree
twoeener: 2810.55915663 hartree
cpcmener: -0.02404209 hartree
kineticenergy: 1811.91003927 hartree
xcener: -128.814279984320 hartree
chargesum: -0.0000000
charge: -0.072919 -0.083027 -0.354667 -0.399746 0.116986 -0.346251 -0.406721 0.575208 0.133057 -0.018268 -0.130165 -0.116298 -0.074138 -0.111308 -0.053509 -0.129735 -0.284854 -0.144258 -0.183781 0.055965 0.111505 0.054639 0.078283 0.101745 0.115486 0.075139 0.069634 0.138238 0.136495 0.060142 0.074027 0.150633 0.098605 0.080261 0.085239 0.122249 0.145563 0.171320 0.159227
qa: -0.0729 -0.0830 -0.3547 -0.3997 0.1170 -0.3463 -0.4067 0.5752 0.1331 -0.0183 -0.1302 -0.1163 -0.0741 -0.1113 -0.0535 -0.1297 -0.2849 -0.1443 -0.1838 0.0560 0.1115 0.0546 0.0783 0.1017 0.1155 0.0751 0.0696 0.1382 0.1365 0.0601 0.0740 0.1506 0.0986 0.0803 0.0852 0.1222 0.1456 0.1713 0.1592
va: 1.2459 1.2211 2.0330 1.9814 3.3877 2.8816 3.0297 3.8615 3.8776 3.9143 3.9320 3.8071 3.6022 3.9057 4.0508 3.9136 3.9243 4.0769 4.0486 4.0679 3.8670 4.0458 0.9916 0.9981 1.0035 1.0196 1.0114 1.0080 1.0289 1.0091 1.0070 1.0224 1.0042 1.0027 1.0013 1.0251 1.0068 1.0010 0.9970
dispcorr: -0.021754971 hartree
energy: -1817.065036966583
dipole: -26.63008 26.09101 -0.53907 27.31498 -28.00274 -0.68776 -10.00782 8.50108 -1.50674
magnitude: 1.74180 au
magnitude: 4.42731 debye
