program: Orca
programVersion: 4.2.1
elementType: Cl Cl O O N N N C C C C C C C C C C C C C C C H H H H H H H H H H H H H H H H H
charge: 0
multiplicity: 1
keywords: wb97x-d3
keywords: def2-TZVPP
keywords: def2/J RIJCOSX GRIDX6 NOFINALGRIDX
keywords: grid4 nofinalgrid
keywords: scfconv7
keywords: smallprint printgap noloewdin
keywords: NOSOSCF
formula: C15H17Cl2N3O2
InChI: InChI=1/C15H17Cl2N3O2/c1-2-3-12-7-21-15(22-12,8-20-10-18-9-19-20)13-5-4-11(16)6-14(13)17/h4-6,9-10,12H,2-3,7-8H2,1H3
39 atoms
Cl 1.818745 -0.665644 -2.261181
Cl 0.837773 -5.440144 -0.114317
O  -0.748767 0.891305 1.11315
O  -0.188581 1.134159 -1.034926
N  1.406534 2.637054 0.772822
N  1.184337 3.165125 1.978617
N  1.139713 4.75793 0.406021
C  0.229486 0.573143 0.168813
C  -1.91876 1.397032 0.464372
C  -1.60223 1.14987 -1.007751
C  -3.156704 0.70518 1.008253
C  1.554173 1.217812 0.591016
C  0.391982 -0.943795 0.062547
C  -4.471022 1.396635 0.654962
C  1.081223 -1.566625 -0.977562
C  -0.138288 -1.764854 1.053431
C  -4.829929 1.407574 -0.824372
C  1.220166 -2.945323 -1.040809
C  -0.012789 -3.143022 1.016875
C  1.369552 3.596411 -0.15633
C  0.66635 -3.72281 -0.039383
C  1.034137 4.435935 1.711017
H  -1.982834 2.473258 0.667948
H  -2.01419 0.195391 -1.359078
H  -1.944303 1.942119 -1.671232
H  -3.071862 0.676144 2.09773
H  -3.176207 -0.335697 0.667762
H  2.327552 1.029871 -0.151902
H  1.891931 0.790172 1.533316
H  -4.450353 2.423167 1.032954
H  -5.268562 0.891759 1.204962
H  -0.668379 -1.321363 1.883838
H  -4.15439 2.02751 -1.415229
H  -4.818228 0.401787 -1.249266
H  -5.832699 1.810615 -0.973544
H  1.754361 -3.401802 -1.862435
H  -0.441548 -3.747915 1.803583
H  1.524268 3.408018 -1.206803
H  0.847017 5.161722 2.487272
elementType: Cl O N C H
totalener: -1817.04375335 hartree
nucrepener: 2158.92059097 hartree
electener: -3975.96434432 hartree
oneelecener: -6783.00956941 hartree
twoeener: 2807.04522509 hartree
cpcmener: -0.02347285 hartree
kineticenergy: 1811.91044366 hartree
xcener: -128.814974782329 hartree
chargesum: -0.0000000
charge: -0.074634 -0.081647 -0.387190 -0.370693 0.127364 -0.352035 -0.410817 0.573382 0.129038 -0.003431 -0.143695 -0.114199 -0.099473 -0.103192 -0.016343 -0.158807 -0.286982 -0.151245 -0.180478 0.063586 0.115544 0.056323 0.084791 0.097684 0.116596 0.078609 0.068538 0.147950 0.129713 0.059744 0.073830 0.154030 0.082101 0.086274 0.098227 0.121314 0.145917 0.163891 0.160414
qa: -0.0746 -0.0816 -0.3872 -0.3707 0.1274 -0.3520 -0.4108 0.5734 0.1290 -0.0034 -0.1437 -0.1142 -0.0995 -0.1032 -0.0163 -0.1588 -0.2870 -0.1512 -0.1805 0.0636 0.1155 0.0563 0.0848 0.0977 0.1166 0.0786 0.0685 0.1480 0.1297 0.0597 0.0738 0.1540 0.0821 0.0863 0.0982 0.1213 0.1459 0.1639 0.1604
va: 1.2454 1.2226 2.0063 1.9918 3.3727 2.8852 3.0316 3.8984 3.8830 3.9116 3.9451 3.7903 3.5443 3.9159 4.0096 3.9589 3.9242 4.0825 4.0532 4.0724 3.8641 4.0518 0.9974 1.0020 0.9998 1.0168 1.0089 1.0161 1.0226 1.0092 1.0056 1.0208 1.0019 1.0016 1.0048 1.0261 1.0069 1.0070 0.9954
dispcorr: -0.021856926 hartree
energy: -1817.065610272783
dipole: -31.16194 30.01376 -1.14817 21.81902 -22.94595 -1.12693 6.59668 -6.88298 -0.28630
magnitude: 1.63409 au
magnitude: 4.15352 debye
