program: Orca
programVersion: 4.2.1
elementType: Cl Cl O O N N N C C C C C C C C C C C C C C C H H H H H H H H H H H H H H H H H
charge: 0
multiplicity: 1
keywords: wb97x-d3
keywords: def2-TZVPP
keywords: def2/J RIJCOSX GRIDX6 NOFINALGRIDX
keywords: grid4 nofinalgrid
keywords: scfconv7
keywords: smallprint printgap noloewdin
keywords: NOSOSCF
formula: C15H17Cl2N3O2
InChI: InChI=1/C15H17Cl2N3O2/c1-2-3-12-7-21-15(22-12,8-20-10-18-9-19-20)13-5-4-11(16)6-14(13)17/h4-6,9-10,12H,2-3,7-8H2,1H3
39 atoms
Cl 0.453232 -1.130714 2.259416
Cl 0.765772 -5.260922 -1.08943
O  -0.577247 1.085033 0.6205
O  0.064925 1.342051 -1.48791
N  1.692454 2.689641 0.45508
N  1.554022 3.122434 1.709611
N  1.529807 4.844604 0.280106
C  0.413423 0.725998 -0.285491
C  -1.798149 1.286644 -0.087311
C  -1.350466 1.346178 -1.556791
C  -2.803236 0.183151 0.198347
C  1.767347 1.284926 0.154784
C  0.511442 -0.791572 -0.455739
C  -4.154523 0.405441 -0.478584
C  0.51862 -1.679691 0.619195
C  0.620926 -1.336997 -1.731336
C  -4.928047 1.607684 0.046026
C  0.596051 -3.051835 0.433576
C  0.700339 -2.702714 -1.946394
C  1.667151 3.724757 -0.388175
C  0.679429 -3.551251 -0.854111
C  1.463885 4.417487 1.557015
H  -2.193503 2.251774 0.240244
H  -1.714288 0.484809 -2.128758
H  -1.6694 2.254076 -2.067968
H  -2.949525 0.1058 1.279548
H  -2.387586 -0.774218 -0.131241
H  2.495995 1.11966 -0.639167
H  2.130376 0.775815 1.044534
H  -4.756335 -0.494523 -0.332227
H  -4.024954 0.497194 -1.562097
H  0.642125 -0.681826 -2.591271
H  -5.91903 1.658937 -0.407437
H  -5.065778 1.547852 1.127776
H  -4.430722 2.554696 -0.17008
H  0.590747 -3.717484 1.28553
H  0.775072 -3.090579 -2.952721
H  1.765792 3.61916 -1.456706
H  1.351519 5.08265 2.399486
elementType: Cl O N C H
totalener: -1817.04300564 hartree
nucrepener: 2173.76486915 hartree
electener: -3990.80787479 hartree
oneelecener: -6812.88005876 hartree
twoeener: 2822.07218397 hartree
cpcmener: -0.02544248 hartree
kineticenergy: 1811.91056086 hartree
xcener: -128.815927728918 hartree
chargesum: 0.0000000
charge: -0.070261 -0.081968 -0.368610 -0.386683 0.121133 -0.345400 -0.415949 0.593533 0.204932 -0.052842 -0.174329 -0.101779 -0.175538 -0.113827 -0.022619 -0.130427 -0.271547 -0.139328 -0.189257 0.065787 0.113905 0.056194 0.103497 0.097542 0.117238 0.072227 0.076581 0.143561 0.135956 0.075785 0.060709 0.152939 0.093653 0.083501 0.078715 0.120789 0.146164 0.165765 0.160255
qa: -0.0703 -0.0820 -0.3686 -0.3867 0.1211 -0.3454 -0.4159 0.5935 0.2049 -0.0528 -0.1743 -0.1018 -0.1755 -0.1138 -0.0226 -0.1304 -0.2715 -0.1393 -0.1893 0.0658 0.1139 0.0562 0.1035 0.0975 0.1172 0.0722 0.0766 0.1436 0.1360 0.0758 0.0607 0.1529 0.0937 0.0835 0.0787 0.1208 0.1462 0.1658 0.1603
va: 1.2480 1.2220 2.0174 1.9825 3.3744 2.8862 3.0292 3.8554 3.8220 3.9243 3.9767 3.7687 3.5742 3.9063 3.9961 3.9321 3.9284 4.0791 4.0542 4.0705 3.8636 4.0555 0.9965 0.9983 0.9979 1.0190 1.0061 1.0070 1.0294 1.0054 1.0104 1.0193 1.0041 1.0007 1.0005 1.0266 1.0067 1.0053 0.9954
dispcorr: -0.022102388 hartree
energy: -1817.065108029116
dipole: -25.53136 24.68769 -0.84366 21.15914 -22.31160 -1.15246 -8.09354 6.31624 -1.77730
magnitude: 2.28007 au
magnitude: 5.79548 debye
