program: Orca
programVersion: 4.2.1
elementType: Cl Cl O O N N N C C C C C C C C C C C C C C C H H H H H H H H H H H H H H H H H
charge: 0
multiplicity: 1
keywords: wb97x-d3
keywords: def2-TZVPP
keywords: def2/J RIJCOSX GRIDX6 NOFINALGRIDX
keywords: grid4 nofinalgrid
keywords: scfconv7
keywords: smallprint printgap noloewdin
keywords: NOSOSCF
formula: C15H17Cl2N3O2
InChI: InChI=1/C15H17Cl2N3O2/c1-2-3-12-7-21-15(22-12,8-20-10-18-9-19-20)13-5-4-11(16)6-14(13)17/h4-6,9-10,12H,2-3,7-8H2,1H3
39 atoms
Cl -0.289104 -0.47774 2.715575
Cl 2.009306 -4.197112 -0.328755
O  -1.747449 1.276566 0.816352
O  -0.816382 1.717589 -1.183344
N  1.730535 2.213907 0.263849
N  2.67436 1.443189 0.809066
N  3.438113 2.410825 -1.058863
C  -0.540514 1.267143 0.115398
C  -2.82166 1.346689 -0.115618
C  -2.174254 2.124387 -1.250812
C  -3.339105 -0.032425 -0.498968
C  0.402073 2.264163 0.813749
C  0.078913 -0.124059 0.027599
C  -4.646151 0.027245 -1.280874
C  0.230372 -0.9557 1.134648
C  0.563638 -0.591978 -1.190001
C  -5.157844 -1.356637 -1.650905
C  0.815927 -2.208561 1.034197
C  1.161382 -1.834015 -1.317834
C  2.196661 2.779027 -0.854088
C  1.277089 -2.636529 -0.197791
C  3.679812 1.594199 -0.013254
H  -3.620339 1.922241 0.359024
H  -2.564912 1.876586 -2.238463
H  -2.266863 3.205472 -1.104786
H  -3.493817 -0.607561 0.418633
H  -2.586094 -0.572847 -1.082302
H  0.473307 2.05669 1.878836
H  0.002132 3.272055 0.696679
H  -4.514936 0.617501 -2.192813
H  -5.40246 0.549916 -0.687258
H  0.47442 0.024782 -2.072307
H  -5.321842 -1.970102 -0.762692
H  -6.104388 -1.300746 -2.190242
H  -4.447148 -1.886114 -2.288549
H  0.911231 -2.83755 1.908397
H  1.525921 -2.165489 -2.280183
H  1.612159 3.44668 -1.467234
H  4.625841 1.100606 0.147758
elementType: Cl O N C H
totalener: -1817.04309499 hartree
nucrepener: 2201.69141818 hartree
electener: -4018.73451317 hartree
oneelecener: -6869.28257124 hartree
twoeener: 2850.54805806 hartree
cpcmener: -0.02431145 hartree
kineticenergy: 1811.90460629 hartree
xcener: -128.814088204258 hartree
chargesum: -0.0000000
charge: -0.074987 -0.085150 -0.370246 -0.392281 0.116444 -0.335720 -0.405902 0.532279 0.199818 0.007573 -0.194437 -0.126135 -0.107215 -0.089219 0.030900 -0.152873 -0.275895 -0.147983 -0.177771 0.061012 0.117383 0.059992 0.102221 0.097294 0.089713 0.070826 0.075433 0.130697 0.127345 0.059290 0.064367 0.146672 0.080230 0.091643 0.081245 0.118666 0.145420 0.169010 0.160342
qa: -0.0750 -0.0851 -0.3702 -0.3923 0.1164 -0.3357 -0.4059 0.5323 0.1998 0.0076 -0.1944 -0.1261 -0.1072 -0.0892 0.0309 -0.1529 -0.2759 -0.1480 -0.1778 0.0610 0.1174 0.0600 0.1022 0.0973 0.0897 0.0708 0.0754 0.1307 0.1273 0.0593 0.0644 0.1467 0.0802 0.0916 0.0812 0.1187 0.1454 0.1690 0.1603
va: 1.2451 1.2187 2.0307 1.9661 3.3487 2.8804 3.0366 3.9029 3.9311 3.9727 3.9441 3.8983 3.5005 3.8861 3.9343 3.8825 3.9410 4.1065 4.0645 4.0704 3.8511 4.0440 0.9970 0.9961 0.9995 1.0229 1.0028 1.0265 1.0104 1.0122 1.0087 1.0262 1.0007 1.0038 1.0016 1.0266 1.0050 1.0036 0.9962
dispcorr: -0.022750712 hartree
energy: -1817.065845704886
dipole: -31.08433 28.59660 -2.48774 12.90475 -11.90186 1.00289 -15.47785 14.69235 -0.78550
magnitude: 2.79493 au
magnitude: 7.10415 debye
