program: Orca
programVersion: 4.2.1
elementType: Cl Cl O O N N N C C C C C C C C C C C C C C C H H H H H H H H H H H H H H H H H
charge: 0
multiplicity: 1
keywords: wb97x-d3
keywords: def2-TZVPP
keywords: def2/J RIJCOSX GRIDX6 NOFINALGRIDX
keywords: grid4 nofinalgrid
keywords: scfconv7
keywords: smallprint printgap noloewdin
keywords: NOSOSCF
formula: C15H17Cl2N3O2
InChI: InChI=1/C15H17Cl2N3O2/c1-2-3-12-7-21-15(22-12,8-20-10-18-9-19-20)13-5-4-11(16)6-14(13)17/h4-6,9-10,12H,2-3,7-8H2,1H3
39 atoms
Cl 0.461428 -1.135497 2.263711
Cl 0.896888 -5.275828 -1.060584
O  -0.576663 1.049289 0.608224
O  0.093461 1.312192 -1.503415
N  1.67647 2.691392 0.432916
N  1.473626 3.142748 1.671999
N  1.485028 4.840406 0.211368
C  0.429623 0.706391 -0.292687
C  -1.729297 1.50111 -0.098376
C  -1.320426 1.349722 -1.562593
C  -2.958132 0.702637 0.287117
C  1.774765 1.283401 0.157523
C  0.543492 -0.810193 -0.451615
C  -4.214165 1.20906 -0.413293
C  0.552271 -1.692545 0.627872
C  0.679083 -1.359491 -1.723066
C  -5.457203 0.433997 -0.005864
C  0.659625 -3.063897 0.449564
C  0.787744 -2.724061 -1.9303
C  1.672401 3.712229 -0.429336
C  0.770026 -3.56778 -0.834244
C  1.366277 4.433121 1.491348
H  -1.883219 2.557806 0.149878
H  -1.720517 0.427789 -2.003731
H  -1.618709 2.189623 -2.188315
H  -3.097679 0.761455 1.370236
H  -2.795653 -0.353325 0.046304
H  2.517661 1.115996 -0.622672
H  2.128686 0.791712 1.060662
H  -4.091267 1.143402 -1.499095
H  -4.35457 2.27044 -0.187297
H  0.698963 -0.707637 -2.585406
H  -5.637149 0.508082 1.068341
H  -6.345315 0.811161 -0.514516
H  -5.363553 -0.625646 -0.251315
H  0.658109 -3.725701 1.304508
H  0.884079 -3.115303 -2.933355
H  1.820429 3.590395 -1.491238
H  1.20611 5.11122 2.31588
elementType: Cl O N C H
totalener: -1817.04540188 hartree
nucrepener: 2159.12467373 hartree
electener: -3976.17007561 hartree
oneelecener: -6783.63691022 hartree
twoeener: 2807.46683461 hartree
cpcmener: -0.02507817 hartree
kineticenergy: 1811.91392500 hartree
xcener: -128.814663938418 hartree
chargesum: -0.0000000
charge: -0.070986 -0.082347 -0.363334 -0.385946 0.121492 -0.344560 -0.412606 0.583594 0.196792 -0.053152 -0.162941 -0.106600 -0.118574 -0.090260 -0.042620 -0.139530 -0.281840 -0.145818 -0.186473 0.061427 0.114669 0.055334 0.091749 0.100680 0.122907 0.070582 0.061247 0.141244 0.136498 0.064259 0.066886 0.152630 0.081532 0.091698 0.079431 0.120803 0.146027 0.166281 0.159820
qa: -0.0710 -0.0823 -0.3633 -0.3859 0.1215 -0.3446 -0.4126 0.5836 0.1968 -0.0532 -0.1629 -0.1066 -0.1186 -0.0903 -0.0426 -0.1395 -0.2818 -0.1458 -0.1865 0.0614 0.1147 0.0553 0.0917 0.1007 0.1229 0.0706 0.0612 0.1412 0.1365 0.0643 0.0669 0.1526 0.0815 0.0917 0.0794 0.1208 0.1460 0.1663 0.1598
va: 1.2472 1.2218 2.0194 1.9870 3.3797 2.8872 3.0302 3.8732 3.8450 3.9212 3.9826 3.7835 3.5743 3.8770 4.0247 3.9250 3.9478 4.0827 4.0516 4.0712 3.8649 4.0530 1.0005 0.9948 0.9957 1.0172 1.0078 1.0080 1.0281 1.0082 1.0079 1.0207 1.0006 1.0030 1.0008 1.0266 1.0069 1.0049 0.9957
dispcorr: -0.021370157 hartree
energy: -1817.066772034990
dipole: -27.15840 26.40404 -0.75436 20.73061 -21.66757 -0.93696 -8.02834 6.26912 -1.75922
magnitude: 2.13115 au
magnitude: 5.41695 debye
