program: Orca
programVersion: 4.2.1
elementType: Cl Cl O O N N N C C C C C C C C C C C C C C C H H H H H H H H H H H H H H H H H
charge: 0
multiplicity: 1
keywords: wb97x-d3
keywords: def2-TZVPP
keywords: def2/J RIJCOSX GRIDX6 NOFINALGRIDX
keywords: grid4 nofinalgrid
keywords: scfconv7
keywords: smallprint printgap noloewdin
keywords: NOSOSCF
formula: C15H17Cl2N3O2
InChI: InChI=1/C15H17Cl2N3O2/c1-2-3-12-7-21-15(22-12,8-20-10-18-9-19-20)13-5-4-11(16)6-14(13)17/h4-6,9-10,12H,2-3,7-8H2,1H3
39 atoms
Cl 0.188116 -1.197783 2.383516
Cl 1.088934 -5.342617 -0.838042
O  -0.714768 0.957322 0.612386
O  0.140427 1.213776 -1.429927
N  1.551694 2.676051 0.491632
N  2.048367 3.474808 -0.45486
N  0.98914 4.677515 1.106602
C  0.379783 0.630339 -0.189695
C  -1.817936 1.338064 -0.209068
C  -1.261886 1.188606 -1.624924
C  -3.029178 0.471964 0.07715
C  1.653746 1.24472 0.394662
C  0.546176 -0.884647 -0.313495
C  -4.262927 0.874817 -0.728154
C  0.468076 -1.759092 0.769379
C  0.826974 -1.439815 -1.558732
C  -4.807595 2.254899 -0.384782
C  0.633384 -3.128116 0.617115
C  0.9938 -2.801916 -1.740492
C  0.915284 3.404988 1.411214
C  0.889038 -3.637749 -0.643337
C  1.692855 4.663011 -0.042562
H  -2.039485 2.387905 0.007154
H  -1.580456 0.247337 -2.089536
H  -1.533239 2.007647 -2.289265
H  -3.262969 0.524891 1.144402
H  -2.775505 -0.570967 -0.136449
H  2.507553 1.008088 -0.237898
H  1.854154 0.830725 1.381525
H  -5.041914 0.130843 -0.547348
H  -4.04978 0.819479 -1.800624
H  0.918362 -0.79361 -2.420945
H  -5.018137 2.342562 0.683258
H  -4.116178 3.057005 -0.648639
H  -5.739204 2.45008 -0.917787
H  0.564087 -3.783782 1.474313
H  1.202701 -3.197332 -2.724825
H  0.42891 2.975718 2.271484
H  1.955375 5.556682 -0.587358
elementType: Cl O N C H
totalener: -1817.04389404 hartree
nucrepener: 2164.07449482 hartree
electener: -3981.11838886 hartree
oneelecener: -6793.29061901 hartree
twoeener: 2812.17223014 hartree
cpcmener: -0.02372332 hartree
kineticenergy: 1811.92450129 hartree
xcener: -128.818079409922 hartree
chargesum: 0.0000000
charge: -0.074820 -0.082111 -0.380220 -0.371913 0.129857 -0.351010 -0.415986 0.581793 0.172855 -0.038853 -0.158168 -0.114183 -0.121452 -0.110045 -0.037137 -0.144886 -0.273207 -0.144821 -0.183380 0.062157 0.114154 0.057652 0.101118 0.096598 0.119827 0.073144 0.072408 0.129135 0.151261 0.076002 0.061678 0.153346 0.083554 0.079278 0.093605 0.121187 0.146638 0.164264 0.160681
qa: -0.0748 -0.0821 -0.3802 -0.3719 0.1299 -0.3510 -0.4160 0.5818 0.1729 -0.0389 -0.1582 -0.1142 -0.1215 -0.1100 -0.0371 -0.1449 -0.2732 -0.1448 -0.1834 0.0622 0.1142 0.0577 0.1011 0.0966 0.1198 0.0731 0.0724 0.1291 0.1513 0.0760 0.0617 0.1533 0.0836 0.0793 0.0936 0.1212 0.1466 0.1643 0.1607
va: 1.2420 1.2221 2.0006 2.0088 3.3623 2.8891 3.0263 3.8915 3.8246 3.9255 3.9778 3.7778 3.5656 3.9021 4.0175 3.9324 3.9298 4.0796 4.0479 4.0640 3.8660 4.0557 0.9959 0.9965 0.9967 1.0153 1.0098 1.0255 1.0111 1.0061 1.0089 1.0210 1.0008 1.0001 1.0042 1.0262 1.0064 1.0069 0.9950
dispcorr: -0.021783719 hartree
energy: -1817.065677761549
dipole: -25.84045 24.79529 -1.04516 23.88570 -25.12473 -1.23903 -9.06637 8.42094 -0.64543
magnitude: 1.74475 au
magnitude: 4.43480 debye
