program: Orca
programVersion: 4.2.1
elementType: Cl Cl O O N N N C C C C C C C C C C C C C C C H H H H H H H H H H H H H H H H H
charge: 0
multiplicity: 1
keywords: wb97x-d3
keywords: def2-TZVPP
keywords: def2/J RIJCOSX GRIDX6 NOFINALGRIDX
keywords: grid4 nofinalgrid
keywords: scfconv7
keywords: smallprint printgap noloewdin
keywords: NOSOSCF
formula: C15H17Cl2N3O2
InChI: InChI=1/C15H17Cl2N3O2/c1-2-3-12-7-21-15(22-12,8-20-10-18-9-19-20)13-5-4-11(16)6-14(13)17/h4-6,9-10,12H,2-3,7-8H2,1H3
39 atoms
Cl 2.251959 -0.751557 -1.844835
Cl 0.451592 -5.400998 0.030839
O  -1.002754 1.065918 0.711891
O  0.133596 1.154172 -1.225025
N  1.329047 2.615176 0.969858
N  1.9199 3.388328 0.055755
N  0.845512 4.643738 1.567874
C  0.163936 0.639045 0.071617
C  -1.901977 1.632878 -0.239706
C  -0.953482 2.051222 -1.354271
C  -2.976852 0.650637 -0.678334
C  1.354118 1.18025 0.882031
C  0.254638 -0.883811 0.024762
C  -3.926694 0.212439 0.433507
C  1.14548 -1.573738 -0.796594
C  -0.54851 -1.643128 0.869804
C  -4.844033 1.323057 0.927521
C  1.209433 -2.959612 -0.803334
C  -0.502702 -3.026628 0.886759
C  0.686675 3.376158 1.860743
C  0.376744 -3.674894 0.038532
C  1.607147 4.594062 0.455904
H  -2.356433 2.50739 0.231017
H  -1.386923 1.937044 -2.349081
H  -0.622878 3.088834 -1.244592
H  -2.506738 -0.224517 -1.138016
H  -3.557366 1.133613 -1.471116
H  2.300577 0.881837 0.43585
H  1.319031 0.767703 1.890481
H  -3.36016 -0.197638 1.273875
H  -4.538588 -0.611514 0.058183
H  -1.235282 -1.144901 1.538687
H  -4.290947 2.166486 1.345037
H  -5.468243 1.709039 0.118627
H  -5.511342 0.961785 1.711286
H  1.903545 -3.469163 -1.457268
H  -1.146511 -3.582787 1.553741
H  0.137955 2.968717 2.695178
H  1.944968 5.473539 -0.0702
elementType: Cl O N C H
totalener: -1817.04228028 hartree
nucrepener: 2175.10148339 hartree
electener: -3992.14376366 hartree
oneelecener: -6815.52879222 hartree
twoeener: 2823.38502856 hartree
cpcmener: -0.02440069 hartree
kineticenergy: 1811.89936452 hartree
xcener: -128.814228451987 hartree
chargesum: 0.0000000
charge: -0.070495 -0.082921 -0.407633 -0.357717 0.119501 -0.352128 -0.407000 0.574373 0.168627 -0.006595 -0.197250 -0.119874 -0.064574 -0.105637 -0.043978 -0.166967 -0.273007 -0.142777 -0.181610 0.055782 0.108814 0.059391 0.104968 0.094187 0.089352 0.092052 0.084232 0.133349 0.138197 0.058598 0.075198 0.172577 0.079715 0.081924 0.091969 0.121843 0.144062 0.171621 0.159831
qa: -0.0705 -0.0829 -0.4076 -0.3577 0.1195 -0.3521 -0.4070 0.5744 0.1686 -0.0066 -0.1973 -0.1199 -0.0646 -0.1056 -0.0440 -0.1670 -0.2730 -0.1428 -0.1816 0.0558 0.1088 0.0594 0.1050 0.0942 0.0894 0.0921 0.0842 0.1333 0.1382 0.0586 0.0752 0.1726 0.0797 0.0819 0.0920 0.1218 0.1441 0.1716 0.1598
va: 1.2487 1.2209 1.9805 2.0155 3.3811 2.8676 3.0278 3.8758 3.8420 4.0215 3.9339 3.8161 3.4873 3.8757 4.0399 3.9384 3.9323 4.0772 4.0648 4.0647 3.8685 4.0405 0.9954 0.9969 0.9929 1.0030 1.0123 1.0304 1.0052 1.0171 1.0080 1.0041 1.0007 1.0013 1.0036 1.0250 1.0086 1.0000 0.9964
dispcorr: -0.022540546 hartree
energy: -1817.064820822559
dipole: -30.40819 28.88242 -1.52577 21.67881 -22.50814 -0.82932 7.24867 -6.69016 0.55851
magnitude: 1.82419 au
magnitude: 4.63673 debye
