program: Orca
programVersion: 4.2.1
elementType: Cl Cl O O N N N C C C C C C C C C C C C C C C H H H H H H H H H H H H H H H H H
charge: 0
multiplicity: 1
keywords: wb97x-d3
keywords: def2-TZVPP
keywords: def2/J RIJCOSX GRIDX6 NOFINALGRIDX
keywords: grid4 nofinalgrid
keywords: scfconv7
keywords: smallprint printgap noloewdin
keywords: NOSOSCF
formula: C15H17Cl2N3O2
InChI: InChI=1/C15H17Cl2N3O2/c1-2-3-12-7-21-15(22-12,8-20-10-18-9-19-20)13-5-4-11(16)6-14(13)17/h4-6,9-10,12H,2-3,7-8H2,1H3
39 atoms
Cl -0.07643 -1.287251 2.101015
Cl 1.341463 -5.310186 -1.091182
O  -0.799023 0.875574 0.27804
O  0.360761 1.251217 -1.608056
N  1.39651 2.64014 0.626137
N  0.78639 3.093678 1.7231
N  1.246671 4.783772 0.328274
C  0.413696 0.620218 -0.36103
C  -1.625035 1.686876 -0.550464
C  -1.001048 1.484058 -1.919151
C  -3.071338 1.258297 -0.448179
C  1.595894 1.233329 0.403086
C  0.6251 -0.883746 -0.513578
C  -3.665735 1.421116 0.945299
C  0.426611 -1.793624 0.524061
C  1.07439 -1.39201 -1.728384
C  -5.138924 1.04621 0.988884
C  0.642554 -3.153229 0.354453
C  1.298961 -2.744223 -1.925113
C  1.657487 3.657123 -0.200528
C  1.074532 -3.616637 -0.875621
C  0.722034 4.38118 1.503621
H  -1.531819 2.73681 -0.241272
H  -1.44091 0.627524 -2.444836
H  -1.069935 2.360779 -2.56187
H  -3.165869 0.218283 -0.777321
H  -3.642983 1.863111 -1.160271
H  2.511582 1.08962 -0.170702
H  1.733105 0.753524 1.369568
H  -3.542066 2.457089 1.27544
H  -3.11006 0.803764 1.655163
H  1.254634 -0.717409 -2.553508
H  -5.551037 1.165186 1.991909
H  -5.729861 1.670649 0.31556
H  -5.294415 0.006708 0.692822
H  0.476137 -3.837413 1.17498
H  1.643999 -3.103377 -2.884593
H  2.151439 3.532009 -1.150975
H  0.284222 5.059059 2.220095
elementType: Cl O N C H
totalener: -1817.04555344 hartree
nucrepener: 2166.77243750 hartree
electener: -3983.81799094 hartree
oneelecener: -6799.08358056 hartree
twoeener: 2815.26558962 hartree
cpcmener: -0.02359177 hartree
kineticenergy: 1811.91233474 hartree
xcener: -128.813484961167 hartree
chargesum: 0.0000000
charge: -0.074045 -0.083247 -0.348330 -0.391855 0.115693 -0.340012 -0.407976 0.578508 0.149825 -0.006471 -0.165822 -0.116368 -0.073340 -0.060093 -0.051250 -0.131093 -0.286227 -0.145887 -0.184501 0.056807 0.112948 0.051286 0.074734 0.090360 0.115730 0.060111 0.075365 0.137197 0.135596 0.055286 0.060923 0.150468 0.091263 0.079101 0.079411 0.122078 0.144892 0.169348 0.159585
qa: -0.0740 -0.0832 -0.3483 -0.3919 0.1157 -0.3400 -0.4080 0.5785 0.1498 -0.0065 -0.1658 -0.1164 -0.0733 -0.0601 -0.0512 -0.1311 -0.2862 -0.1459 -0.1845 0.0568 0.1129 0.0513 0.0747 0.0904 0.1157 0.0601 0.0754 0.1372 0.1356 0.0553 0.0609 0.1505 0.0913 0.0791 0.0794 0.1221 0.1449 0.1693 0.1596
va: 1.2430 1.2210 2.0303 1.9795 3.3890 2.8864 3.0308 3.8393 3.9005 3.9564 3.9603 3.8140 3.5982 3.8457 4.0436 3.9177 3.9467 4.0754 4.0476 4.0677 3.8639 4.0513 0.9977 1.0030 0.9994 1.0177 1.0121 1.0092 1.0271 1.0110 1.0196 1.0230 1.0038 1.0005 1.0006 1.0251 1.0072 1.0024 0.9968
dispcorr: -0.021592624 hartree
energy: -1817.067146062863
dipole: -24.30016 24.13147 -0.16869 24.49143 -25.10555 -0.61412 -4.52892 2.87549 -1.65342
magnitude: 1.77184 au
magnitude: 4.50366 debye
