program: Orca
programVersion: 4.2.1
elementType: Cl Cl O O N N N C C C C C C C C C C C C C C C H H H H H H H H H H H H H H H H H
charge: 0
multiplicity: 1
keywords: wb97x-d3
keywords: def2-TZVPP
keywords: def2/J RIJCOSX GRIDX6 NOFINALGRIDX
keywords: grid4 nofinalgrid
keywords: scfconv7
keywords: smallprint printgap noloewdin
keywords: NOSOSCF
formula: C15H17Cl2N3O2
InChI: InChI=1/C15H17Cl2N3O2/c1-2-3-12-7-21-15(22-12,8-20-10-18-9-19-20)13-5-4-11(16)6-14(13)17/h4-6,9-10,12H,2-3,7-8H2,1H3
39 atoms
Cl 2.47827 -0.744079 -1.573962
Cl 0.28072 -5.355387 -0.064668
O  -1.012797 1.132224 0.583039
O  0.373077 1.276114 -1.154992
N  1.351171 2.632898 1.094613
N  2.160952 3.336941 0.301797
N  0.866307 4.704909 1.511615
C  0.223713 0.693631 0.09744
C  -1.826816 1.567618 -0.508977
C  -0.921051 1.34044 -1.718352
C  -3.140644 0.817795 -0.578254
C  1.315879 1.196599 1.044788
C  0.26133 -0.834844 0.031007
C  -4.033836 1.017203 0.639299
C  1.22165 -1.543224 -0.69048
C  -0.674479 -1.579762 0.742735
C  -5.367112 0.298931 0.500979
C  1.233251 -2.929994 -0.727143
C  -0.684701 -2.963925 0.727222
C  0.58049 3.460167 1.805777
C  0.272273 -3.628573 -0.018384
C  1.839435 4.570891 0.588459
H  -2.022217 2.636455 -0.368661
H  -1.172707 0.411094 -2.24524
H  -0.951304 2.159681 -2.435568
H  -2.94851 -0.249051 -0.734824
H  -3.665837 1.167853 -1.473843
H  2.29807 0.845947 0.73569
H  1.125993 0.805692 2.044263
H  -4.208615 2.086763 0.790706
H  -3.52239 0.661056 1.537599
H  -1.422636 -1.069331 1.332262
H  -5.92762 0.661303 -0.363098
H  -5.229259 -0.776922 0.374856
H  -5.99215 0.447005 1.382688
H  1.985042 -3.453339 -1.301541
H  -1.430585 -3.508077 1.289463
H  -0.150837 3.117635 2.520343
H  2.32669 5.410001 0.116528
elementType: Cl O N C H
totalener: -1817.04564402 hartree
nucrepener: 2162.05786543 hartree
electener: -3979.10350944 hartree
oneelecener: -6789.35522443 hartree
twoeener: 2810.25171499 hartree
cpcmener: -0.02561550 hartree
kineticenergy: 1811.92178101 hartree
xcener: -128.816133923813 hartree
chargesum: 0.0000000
charge: -0.069590 -0.081709 -0.399637 -0.349629 0.125734 -0.349105 -0.415401 0.572135 0.163906 0.008133 -0.204238 -0.100148 -0.099861 -0.074243 -0.020414 -0.183785 -0.283285 -0.152148 -0.178590 0.058107 0.116067 0.058955 0.088871 0.084214 0.114621 0.066971 0.093776 0.131511 0.141864 0.064063 0.061083 0.164733 0.080204 0.079744 0.092244 0.121173 0.144723 0.168696 0.160258
qa: -0.0696 -0.0817 -0.3996 -0.3496 0.1257 -0.3491 -0.4154 0.5721 0.1639 0.0081 -0.2042 -0.1001 -0.0999 -0.0742 -0.0204 -0.1838 -0.2833 -0.1521 -0.1786 0.0581 0.1161 0.0590 0.0889 0.0842 0.1146 0.0670 0.0938 0.1315 0.1419 0.0641 0.0611 0.1647 0.0802 0.0797 0.0922 0.1212 0.1447 0.1687 0.1603
va: 1.2515 1.2223 1.9767 2.0105 3.3719 2.8854 3.0273 3.9088 3.8716 3.9403 3.9546 3.7842 3.5200 3.8488 4.0094 3.9584 3.9454 4.0781 4.0575 4.0678 3.8599 4.0532 1.0028 1.0039 0.9957 1.0056 1.0123 1.0320 1.0055 1.0087 1.0157 1.0061 1.0011 1.0002 1.0038 1.0263 1.0074 1.0022 0.9952
dispcorr: -0.021748056 hartree
energy: -1817.067392070741
dipole: -32.73461 30.97219 -1.76242 18.89159 -20.11053 -1.21894 5.21180 -4.97744 0.23436
magnitude: 2.15566 au
magnitude: 5.47925 debye
