program: Orca
programVersion: 4.2.1
elementType: Cl Cl O O N N N C C C C C C C C C C C C C C C H H H H H H H H H H H H H H H H H
charge: 0
multiplicity: 1
keywords: wb97x-d3
keywords: def2-TZVPP
keywords: def2/J RIJCOSX GRIDX6 NOFINALGRIDX
keywords: grid4 nofinalgrid
keywords: scfconv7
keywords: smallprint printgap noloewdin
keywords: NOSOSCF
formula: C15H17Cl2N3O2
InChI: InChI=1/C15H17Cl2N3O2/c1-2-3-12-7-21-15(22-12,8-20-10-18-9-19-20)13-5-4-11(16)6-14(13)17/h4-6,9-10,12H,2-3,7-8H2,1H3
39 atoms
Cl -0.11338 -1.075669 2.265196
Cl 0.56807 -5.256665 -0.96393
O  -0.748291 1.18067 0.4327
O  0.343671 1.349502 -1.519032
N  1.691537 2.65903 0.573713
N  1.185514 3.30029 1.628624
N  1.937073 4.76349 0.110052
C  0.382903 0.74932 -0.252477
C  -1.726209 1.592489 -0.517715
C  -0.849872 2.107413 -1.650737
C  -2.660677 0.468848 -0.942711
C  1.652394 1.225733 0.467522
C  0.42781 -0.77165 -0.402241
C  -3.447766 -0.175273 0.193354
C  0.209161 -1.645582 0.661157
C  0.720115 -1.338757 -1.639347
C  -4.45056 0.759121 0.85467
C  0.246964 -3.022665 0.497866
C  0.770355 -2.708805 -1.830066
C  2.131041 3.542782 -0.326174
C  0.524685 -3.542248 -0.75354
C  1.355583 4.556315 1.308283
H  -2.292632 2.404123 -0.057064
H  -1.27858 1.934889 -2.63929
H  -0.634814 3.175281 -1.549101
H  -2.097598 -0.299447 -1.481012
H  -3.360262 0.893017 -1.670885
H  2.523893 0.89122 -0.095131
H  1.7275 0.80772 1.468899
H  -2.761505 -0.571714 0.944662
H  -3.980622 -1.039722 -0.210243
H  0.907209 -0.697758 -2.488717
H  -3.969568 1.60742 1.344101
H  -5.159787 1.158338 0.126859
H  -5.027206 0.236442 1.6192
H  0.063334 -3.675971 1.339468
H  0.995165 -3.11251 -2.80731
H  2.588936 3.254399 -1.258638
H  1.055328 5.35693 1.966204
elementType: Cl O N C H
totalener: -1817.04283453 hartree
nucrepener: 2197.27958188 hartree
electener: -4014.32241641 hartree
oneelecener: -6860.04491589 hartree
twoeener: 2845.72249949 hartree
cpcmener: -0.02481576 hartree
kineticenergy: 1811.91586056 hartree
xcener: -128.818448525316 hartree
chargesum: -0.0000000
charge: -0.079595 -0.082479 -0.361958 -0.405623 0.134651 -0.352930 -0.411223 0.558025 0.191628 -0.012905 -0.200729 -0.118760 -0.071396 -0.110362 -0.040241 -0.171533 -0.278531 -0.135969 -0.161578 0.048433 0.105734 0.059642 0.111486 0.100968 0.094869 0.091072 0.087133 0.139333 0.136906 0.058216 0.074608 0.146577 0.082087 0.081520 0.092517 0.120792 0.146383 0.172760 0.160474
qa: -0.0796 -0.0825 -0.3620 -0.4056 0.1347 -0.3529 -0.4112 0.5580 0.1916 -0.0129 -0.2007 -0.1188 -0.0714 -0.1104 -0.0402 -0.1715 -0.2785 -0.1360 -0.1616 0.0484 0.1057 0.0596 0.1115 0.1010 0.0949 0.0911 0.0871 0.1393 0.1369 0.0582 0.0746 0.1466 0.0821 0.0815 0.0925 0.1208 0.1464 0.1728 0.1605
va: 1.2356 1.2217 2.0094 1.9714 3.3698 2.8892 3.0262 3.8922 3.8204 3.9936 3.9332 3.8043 3.5118 3.8841 3.9764 3.9596 3.9362 4.0786 4.0258 4.0575 3.8686 4.0483 0.9906 0.9978 0.9954 1.0016 1.0113 1.0058 1.0305 1.0265 1.0091 1.0287 0.9989 1.0007 1.0038 1.0256 1.0053 1.0008 0.9955
dispcorr: -0.023222927 hartree
energy: -1817.066057452900
dipole: -19.99522 19.53298 -0.46224 20.14960 -21.00443 -0.85483 -7.00181 5.41897 -1.58284
magnitude: 1.85735 au
magnitude: 4.72102 debye
