program: Orca
programVersion: 4.2.1
elementType: Cl Cl O O N N N C C C C C C C C C C C C C C C H H H H H H H H H H H H H H H H H
charge: 0
multiplicity: 1
keywords: wb97x-d3
keywords: def2-TZVPP
keywords: def2/J RIJCOSX GRIDX6 NOFINALGRIDX
keywords: grid4 nofinalgrid
keywords: scfconv7
keywords: smallprint printgap noloewdin
keywords: NOSOSCF
formula: C15H17Cl2N3O2
InChI: InChI=1/C15H17Cl2N3O2/c1-2-3-12-7-21-15(22-12,8-20-10-18-9-19-20)13-5-4-11(16)6-14(13)17/h4-6,9-10,12H,2-3,7-8H2,1H3
39 atoms
Cl 0.433802 -0.996589 2.292802
Cl 0.436121 -5.20967 -0.965336
O  -0.488042 1.239208 0.615828
O  0.14766 1.415544 -1.502069
N  1.876539 2.695617 0.403925
N  1.787897 3.149894 1.654998
N  1.844919 4.854836 0.205705
C  0.47002 0.802103 -0.290651
C  -1.70582 1.472524 -0.084376
C  -1.263761 1.522539 -1.556875
C  -2.751707 0.4071 0.196925
C  1.861583 1.286052 0.119932
C  0.472607 -0.721149 -0.429431
C  -4.088976 0.737791 -0.456571
C  0.440313 -1.584393 0.665245
C  0.529506 -1.299747 -1.69345
C  -5.131911 -0.344966 -0.229043
C  0.428328 -2.962132 0.509606
C  0.520824 -2.672035 -1.878736
C  1.901494 3.721626 -0.450661
C  0.461598 -3.493613 -0.767584
C  1.775656 4.446079 1.488181
H  -2.081791 2.44525 0.246088
H  -1.69283 0.699142 -2.139055
H  -1.521059 2.459044 -2.050705
H  -2.888803 0.315806 1.277966
H  -2.396521 -0.566013 -0.158907
H  2.561145 1.069423 -0.68792
H  2.21506 0.765243 1.006945
H  -3.957851 0.8837 -1.533706
H  -4.457687 1.69118 -0.066455
H  0.578988 -0.665555 -2.567745
H  -5.314305 -0.507107 0.835015
H  -6.085162 -0.080386 -0.688766
H  -4.814793 -1.298023 -0.65683
H  0.394148 -3.607772 1.376168
H  0.558309 -3.086221 -2.876501
H  1.97516 3.599018 -1.519216
H  1.718802 5.126251 2.32388
elementType: Cl O N C H
totalener: -1817.04430765 hartree
nucrepener: 2172.66085547 hartree
electener: -3989.70516312 hartree
oneelecener: -6810.63810672 hartree
twoeener: 2820.93294360 hartree
cpcmener: -0.02541546 hartree
kineticenergy: 1811.92353558 hartree
xcener: -128.817390229334 hartree
chargesum: -0.0000000
charge: -0.069941 -0.081798 -0.366381 -0.386072 0.120163 -0.344798 -0.415572 0.590216 0.243035 -0.067777 -0.186812 -0.100231 -0.183419 -0.095200 -0.017136 -0.125111 -0.278427 -0.140687 -0.190851 0.066033 0.115399 0.055985 0.097887 0.097602 0.117938 0.069993 0.064603 0.143500 0.135994 0.063408 0.069536 0.152533 0.080918 0.092385 0.080218 0.120843 0.146209 0.165567 0.160245
qa: -0.0699 -0.0818 -0.3664 -0.3861 0.1202 -0.3448 -0.4156 0.5902 0.2430 -0.0678 -0.1868 -0.1002 -0.1834 -0.0952 -0.0171 -0.1251 -0.2784 -0.1407 -0.1909 0.0660 0.1154 0.0560 0.0979 0.0976 0.1179 0.0700 0.0646 0.1435 0.1360 0.0634 0.0695 0.1525 0.0809 0.0924 0.0802 0.1208 0.1462 0.1656 0.1602
va: 1.2487 1.2222 2.0187 1.9825 3.3730 2.8857 3.0293 3.8562 3.8185 3.9381 3.9828 3.7672 3.5693 3.8762 3.9904 3.9293 3.9427 4.0808 4.0567 4.0701 3.8607 4.0561 1.0000 0.9951 0.9968 1.0220 1.0011 1.0073 1.0295 1.0107 1.0083 1.0192 1.0010 1.0031 1.0017 1.0266 1.0067 1.0052 0.9953
dispcorr: -0.021900321 hartree
energy: -1817.066207975256
dipole: -24.95340 24.03580 -0.91760 17.19832 -18.29336 -1.09504 -9.10955 7.35865 -1.75090
magnitude: 2.25981 au
magnitude: 5.74399 debye
