program: Orca
programVersion: 4.2.1
elementType: Cl Cl O O N N N C C C C C C C C C C C C C C C H H H H H H H H H H H H H H H H H
charge: 0
multiplicity: 1
keywords: wb97x-d3
keywords: def2-TZVPP
keywords: def2/J RIJCOSX GRIDX6 NOFINALGRIDX
keywords: grid4 nofinalgrid
keywords: scfconv7
keywords: smallprint printgap noloewdin
keywords: NOSOSCF
formula: C15H17Cl2N3O2
InChI: InChI=1/C15H17Cl2N3O2/c1-2-3-12-7-21-15(22-12,8-20-10-18-9-19-20)13-5-4-11(16)6-14(13)17/h4-6,9-10,12H,2-3,7-8H2,1H3
39 atoms
Cl -0.775872 -0.593837 2.317077
Cl 1.847002 -4.131314 -0.68039
O  -1.775425 1.435106 0.375658
O  -0.491011 2.057259 -1.325547
N  1.780321 2.232384 0.538221
N  2.596912 1.374072 1.154158
N  3.689284 2.468951 -0.463596
C  -0.459129 1.430004 -0.077541
C  -2.639632 1.338372 -0.755253
C  -1.723143 1.707832 -1.933963
C  -3.268818 -0.035703 -0.897408
C  0.380674 2.295438 0.868324
C  0.106876 0.014689 -0.200875
C  -4.169763 -0.431219 0.264574
C  0.000339 -0.940783 0.807559
C  0.80333 -0.35066 -1.348117
C  -4.789578 -1.806353 0.067827
C  0.525623 -2.215742 0.6686
C  1.346124 -1.61391 -1.512929
C  2.443248 2.873472 -0.430059
C  1.192909 -2.541351 -0.499313
C  3.72888 1.551231 0.524004
H  -3.425648 2.086413 -0.617666
H  -1.599096 0.868963 -2.627702
H  -2.084498 2.566757 -2.499091
H  -2.485545 -0.788542 -1.037162
H  -3.8525 -0.029399 -1.824621
H  0.26597 1.966388 1.898277
H  0.038416 3.328726 0.80378
H  -4.962679 0.314145 0.382127
H  -3.596369 -0.421326 1.194021
H  0.931886 0.367222 -2.146073
H  -4.022586 -2.578849 -0.019061
H  -5.432674 -2.077808 0.90621
H  -5.39802 -1.845355 -0.83816
H  0.419038 -2.940153 1.464156
H  1.878942 -1.861976 -2.420259
H  1.989362 3.618591 -1.064181
H  4.619396 1.002906 0.789685
elementType: Cl O N C H
totalener: -1817.04380941 hartree
nucrepener: 2227.73307095 hartree
electener: -4044.77688036 hartree
oneelecener: -6921.23853104 hartree
twoeener: 2876.46165067 hartree
cpcmener: -0.02349500 hartree
kineticenergy: 1811.90534979 hartree
xcener: -128.814730124274 hartree
chargesum: -0.0000000
charge: -0.077877 -0.083467 -0.372713 -0.381917 0.109813 -0.334965 -0.405489 0.584687 0.236280 -0.059581 -0.225221 -0.086955 -0.191977 -0.088639 0.011231 -0.117435 -0.278386 -0.133576 -0.198076 0.061211 0.119333 0.059952 0.099068 0.096341 0.109564 0.070775 0.092309 0.133305 0.128431 0.063979 0.061567 0.152705 0.078295 0.091998 0.079159 0.119688 0.145580 0.170364 0.160638
qa: -0.0779 -0.0835 -0.3727 -0.3819 0.1098 -0.3350 -0.4055 0.5847 0.2363 -0.0596 -0.2252 -0.0870 -0.1920 -0.0886 0.0112 -0.1174 -0.2784 -0.1336 -0.1981 0.0612 0.1193 0.0600 0.0991 0.0963 0.1096 0.0708 0.0923 0.1333 0.1284 0.0640 0.0616 0.1527 0.0783 0.0920 0.0792 0.1197 0.1456 0.1704 0.1606
va: 1.2393 1.2203 2.0182 1.9798 3.3607 2.8771 3.0351 3.8471 3.8092 3.9800 3.9400 3.8166 3.5243 3.8586 3.9386 3.8566 3.9451 4.0924 4.0894 4.0653 3.8555 4.0429 0.9973 0.9942 0.9991 1.0000 1.0139 1.0269 1.0231 1.0084 1.0248 1.0165 1.0009 1.0040 1.0017 1.0252 1.0060 1.0037 0.9960
dispcorr: -0.023799698 hartree
energy: -1817.067609106937
dipole: -26.85863 24.77421 -2.08442 10.07939 -9.45219 0.62720 -9.34054 8.19706 -1.14348
magnitude: 2.45880 au
magnitude: 6.24978 debye
