program: Orca
programVersion: 4.2.1
elementType: Cl Cl O O N N N C C C C C C C C C C C C C C C H H H H H H H H H H H H H H H H H
charge: 0
multiplicity: 1
keywords: wb97x-d3
keywords: def2-TZVPP
keywords: def2/J RIJCOSX GRIDX6 NOFINALGRIDX
keywords: grid4 nofinalgrid
keywords: scfconv7
keywords: smallprint printgap noloewdin
keywords: NOSOSCF
formula: C15H17Cl2N3O2
InChI: InChI=1/C15H17Cl2N3O2/c1-2-3-12-7-21-15(22-12,8-20-10-18-9-19-20)13-5-4-11(16)6-14(13)17/h4-6,9-10,12H,2-3,7-8H2,1H3
39 atoms
Cl 1.737667 -0.743543 -2.204788
Cl 0.627167 -5.399584 0.131104
O  -0.694274 1.037269 1.161961
O  -0.205023 1.118214 -1.029366
N  1.553353 2.659807 0.665525
N  1.889566 3.4170 -0.382891
N  1.124274 4.696687 1.293249
C  0.236912 0.630393 0.197695
C  -1.829683 1.605034 0.521799
C  -1.239768 2.051466 -0.81075
C  -2.973674 0.608476 0.40126
C  1.598905 1.225651 0.601088
C  0.344207 -0.889025 0.143488
C  -4.270811 1.259405 -0.065712
C  0.990137 -1.5718 -0.886784
C  -0.189516 -1.651241 1.177678
C  -5.424126 0.269782 -0.14077
C  1.077486 -2.956366 -0.895237
C  -0.112666 -3.032956 1.191124
C  1.092192 3.440532 1.655314
C  0.520938 -3.678895 0.144621
C  1.618326 4.627904 0.03778
H  -2.147479 2.459961 1.125982
H  -1.945165 1.984708 -1.640558
H  -0.855193 3.075767 -0.770008
H  -3.137216 0.146093 1.379263
H  -2.694001 -0.200696 -0.281633
H  2.369031 0.946547 -0.114321
H  1.884024 0.831486 1.577847
H  -4.12872 1.720087 -1.047677
H  -4.533888 2.076238 0.613529
H  -0.685723 -1.150417 1.996302
H  -6.34125 0.753091 -0.476552
H  -5.205287 -0.54171 -0.836093
H  -5.62536 -0.178213 0.833355
H  1.577545 -3.461413 -1.709223
H  -0.541769 -3.597847 2.006429
H  0.757703 3.053236 2.604787
H  1.792086 5.495857 -0.578795
totalener: -1817.01774021 hartree
nucrepener: 2161.98643600 hartree
electener: -3979.00417621 hartree
oneelecener: -6789.08324069 hartree
twoeener: 2810.07906448 hartree
kineticenergy: 1811.91300094 hartree
xcener: -128.814046097701 hartree
chargesum: 0.0000000
charge: -0.045220 -0.066068 -0.396040 -0.324707 0.101462 -0.296609 -0.325207 0.572043 0.190314 -0.015674 -0.199220 -0.143322 -0.078403 -0.091509 -0.047176 -0.127142 -0.256386 -0.148828 -0.163028 0.023892 0.106158 0.046419 0.090426 0.087055 0.088069 0.066688 0.083158 0.134894 0.124834 0.057816 0.060959 0.134986 0.088186 0.077728 0.075626 0.113559 0.124264 0.145229 0.130775
qa: -0.0452 -0.0661 -0.3960 -0.3247 0.1015 -0.2966 -0.3252 0.5720 0.1903 -0.0157 -0.1992 -0.1433 -0.0784 -0.0915 -0.0472 -0.1271 -0.2564 -0.1488 -0.1630 0.0239 0.1062 0.0464 0.0904 0.0871 0.0881 0.0667 0.0832 0.1349 0.1248 0.0578 0.0610 0.1350 0.0882 0.0777 0.0756 0.1136 0.1243 0.1452 0.1308
va: 1.2770 1.2393 1.9981 2.0465 3.3557 2.8454 3.0526 3.8354 3.8970 4.0216 3.9549 3.8346 3.5293 3.8830 4.0961 3.9208 3.9515 4.0721 4.0661 4.0797 3.9307 4.0447 1.0008 1.0031 0.9923 1.0176 1.0040 1.0347 1.0053 1.0143 1.0089 1.0280 1.0059 1.0037 1.0032 1.0282 1.0148 1.0088 1.0028
dispcorr: -0.021909368 hartree
energy: -1817.039649581806
dipole: -30.83659 29.79447 -1.04212 20.74899 -21.34282 -0.59383 7.39309 -6.85288 0.54021
magnitude: 1.31548 au
magnitude: 3.34367 debye
