program: Orca
programVersion: 4.2.1
elementType: Cl Cl O O N N N C C C C C C C C C C C C C C C H H H H H H H H H H H H H H H H H
charge: 0
multiplicity: 1
keywords: wb97x-d3
keywords: def2-TZVPP
keywords: def2/J RIJCOSX GRIDX6 NOFINALGRIDX
keywords: grid4 nofinalgrid
keywords: scfconv7
keywords: smallprint printgap noloewdin
keywords: NOSOSCF
formula: C15H17Cl2N3O2
InChI: InChI=1/C15H17Cl2N3O2/c1-2-3-12-7-21-15(22-12,8-20-10-18-9-19-20)13-5-4-11(16)6-14(13)17/h4-6,9-10,12H,2-3,7-8H2,1H3
39 atoms
Cl 2.573992 -0.601078 -1.651697
Cl 0.7562 -5.470977 -0.497533
O  -1.149123 0.792159 0.479289
O  0.244286 1.183953 -1.236374
N  0.970941 2.496976 1.166762
N  0.205682 2.959744 2.160659
N  0.89302 4.6460 0.850565
C  0.128662 0.521523 -0.012157
C  -1.846068 1.644313 -0.419478
C  -1.061267 1.434908 -1.704705
C  -3.311866 1.271237 -0.506134
C  1.168887 1.089764 0.965494
C  0.308094 -0.985755 -0.16295
C  -4.15647 1.686623 0.695944
C  1.363472 -1.559401 -0.870525
C  -0.593971 -1.852077 0.447824
C  -3.780864 1.02465 2.015739
C  1.504621 -2.935017 -0.978652
C  -0.471416 -3.227296 0.357595
C  1.365077 3.517127 0.38896
C  0.581972 -3.761494 -0.363015
C  0.190434 4.250073 1.934045
H  -1.750209 2.685651 -0.081783
H  -1.451901 0.584468 -2.2796
H  -1.039586 2.313351 -2.349049
H  -3.393698 0.193317 -0.679907
H  -3.720943 1.756797 -1.398535
H  2.178124 0.915877 0.593936
H  1.071763 0.593428 1.92962
H  -5.201159 1.461935 0.466237
H  -4.104455 2.773886 0.807233
H  -1.419328 -1.437997 1.008862
H  -4.500391 1.287365 2.791431
H  -3.780184 -0.06341 1.926373
H  -2.795472 1.329357 2.364549
H  2.32852 -3.352697 -1.539366
H  -1.189168 -3.873945 0.842078
H  1.986818 3.387038 -0.482872
H  -0.339611 4.933829 2.578623
totalener: -1817.01837869 hartree
nucrepener: 2178.68892301 hartree
electener: -3995.70730171 hartree
oneelecener: -6822.52210360 hartree
twoeener: 2826.81480189 hartree
kineticenergy: 1811.91895580 hartree
xcener: -128.814256654775 hartree
chargesum: 0.0000000
charge: -0.059587 -0.064476 -0.352585 -0.344421 0.111407 -0.304892 -0.328230 0.542518 0.098629 0.033391 -0.175065 -0.137013 -0.098623 -0.090201 -0.003091 -0.124653 -0.252695 -0.159656 -0.163627 0.031201 0.112517 0.049309 0.074932 0.075033 0.100945 0.068747 0.079581 0.135164 0.123828 0.067720 0.053795 0.140972 0.090183 0.063732 0.092056 0.113653 0.123882 0.145754 0.129868
qa: -0.0596 -0.0645 -0.3526 -0.3444 0.1114 -0.3049 -0.3282 0.5425 0.0986 0.0334 -0.1751 -0.1370 -0.0986 -0.0902 -0.0031 -0.1247 -0.2527 -0.1597 -0.1636 0.0312 0.1125 0.0493 0.0749 0.0750 0.1009 0.0687 0.0796 0.1352 0.1238 0.0677 0.0538 0.1410 0.0902 0.0637 0.0921 0.1137 0.1239 0.1458 0.1299
va: 1.2628 1.2409 2.0057 2.0057 3.3570 2.8491 3.0552 3.8756 3.9237 3.9511 3.9511 3.8205 3.5924 3.8956 4.0153 3.9618 3.9349 4.0907 4.0621 4.0786 3.9155 4.0396 0.9941 1.0065 0.9967 1.0151 1.0123 1.0206 1.0220 1.0073 1.0106 1.0164 1.0063 1.0035 1.0160 1.0282 1.0147 1.0103 1.0025
dispcorr: -0.022722816 hartree
energy: -1817.041101508849
dipole: -29.98665 29.30745 -0.67919 22.80762 -23.44887 -0.64125 9.06120 -9.54598 -0.48478
magnitude: 1.05238 au
magnitude: 2.67495 debye
