program: Orca
programVersion: 4.2.1
elementType: Cl Cl O O N N N C C C C C C C C C C C C C C C H H H H H H H H H H H H H H H H H
charge: 0
multiplicity: 1
keywords: wb97x-d3
keywords: def2-TZVPP
keywords: def2/J RIJCOSX GRIDX6 NOFINALGRIDX
keywords: grid4 nofinalgrid
keywords: scfconv7
keywords: smallprint printgap noloewdin
keywords: NOSOSCF
formula: C15H17Cl2N3O2
InChI: InChI=1/C15H17Cl2N3O2/c1-2-3-12-7-21-15(22-12,8-20-10-18-9-19-20)13-5-4-11(16)6-14(13)17/h4-6,9-10,12H,2-3,7-8H2,1H3
39 atoms
Cl 0.009388 -1.335344 2.024147
Cl 1.498348 -5.368628 -1.12117
O  -0.870035 0.732403 0.149418
O  0.270317 1.136341 -1.744762
N  1.136617 2.541107 0.681349
N  1.324411 3.601732 -0.110165
N  0.160096 4.182562 1.718295
C  0.354081 0.530212 -0.48961
C  -1.686658 1.586242 -0.64403
C  -1.089334 1.383731 -2.026047
C  -3.1388 1.187139 -0.50143
C  1.500768 1.21251 0.282287
C  0.628006 -0.963271 -0.616273
C  -3.689284 1.319999 0.917189
C  0.493986 -1.856251 0.445855
C  1.059391 -1.480427 -1.832965
C  -3.701215 2.748469 1.446943
C  0.75892 -3.20886 0.297342
C  1.329986 -2.827017 -2.006277
C  0.430527 2.903699 1.762802
C  1.172502 -3.686422 -0.933926
C  0.729167 4.562184 0.552787
H  -1.547714 2.629028 -0.330206
H  -1.553166 0.534279 -2.544818
H  -1.159116 2.266012 -2.661291
H  -3.257289 0.156309 -0.847849
H  -3.72721 1.815259 -1.179072
H  2.389153 1.26282 -0.345602
H  1.750359 0.641555 1.175552
H  -3.116653 0.676357 1.58873
H  -4.708823 0.927545 0.922118
H  1.184193 -0.810135 -2.671512
H  -2.698881 3.162406 1.564689
H  -4.254369 3.413453 0.780563
H  -4.18168 2.795774 2.424129
H  0.641826 -3.880024 1.136192
H  1.65944 -3.200534 -2.965453
H  0.144927 2.209119 2.537479
H  0.710353 5.577617 0.188734
totalener: -1817.01895639 hartree
nucrepener: 2192.17093150 hartree
electener: -4009.18988789 hartree
oneelecener: -6849.51039322 hartree
twoeener: 2840.32050533 hartree
kineticenergy: 1811.91523133 hartree
xcener: -128.814725036095 hartree
chargesum: 0.0000000
charge: -0.066814 -0.064845 -0.349194 -0.340528 0.122445 -0.301807 -0.340949 0.576949 0.089448 0.012046 -0.158807 -0.166125 -0.066672 -0.084610 -0.069687 -0.106173 -0.262783 -0.145985 -0.161979 0.040258 0.103190 0.051451 0.084226 0.076072 0.096334 0.067417 0.070385 0.123003 0.140453 0.065925 0.068523 0.141785 0.085493 0.073052 0.086556 0.115383 0.125285 0.141502 0.129777
qa: -0.0668 -0.0648 -0.3492 -0.3405 0.1224 -0.3018 -0.3409 0.5769 0.0894 0.0120 -0.1588 -0.1661 -0.0667 -0.0846 -0.0697 -0.1062 -0.2628 -0.1460 -0.1620 0.0403 0.1032 0.0515 0.0842 0.0761 0.0963 0.0674 0.0704 0.1230 0.1405 0.0659 0.0685 0.1418 0.0855 0.0731 0.0866 0.1154 0.1253 0.1415 0.1298
va: 1.2531 1.2407 2.0196 2.0387 3.3232 2.8742 3.0231 3.7973 3.9012 3.9952 3.9629 3.8418 3.6206 3.8669 4.0682 3.9120 3.9335 4.0701 4.0515 4.0421 3.9325 4.0418 0.9896 0.9993 0.9999 1.0224 1.0102 1.0305 1.0086 1.0197 1.0074 1.0257 1.0125 1.0043 1.0068 1.0254 1.0144 1.0110 1.0035
dispcorr: -0.023050752 hartree
energy: -1817.042007142667
dipole: -22.41702 22.01715 -0.39987 28.08327 -28.72915 -0.64589 -2.26344 1.59996 -0.66348
magnitude: 1.00860 au
magnitude: 2.56365 debye
