program: Orca
programVersion: 4.2.1
elementType: Cl Cl O O N N N C C C C C C C C C C C C C C C H H H H H H H H H H H H H H H H H
charge: 0
multiplicity: 1
keywords: wb97x-d3
keywords: def2-TZVPP
keywords: def2/J RIJCOSX GRIDX6 NOFINALGRIDX
keywords: grid4 nofinalgrid
keywords: scfconv7
keywords: smallprint printgap noloewdin
keywords: NOSOSCF
formula: C15H17Cl2N3O2
InChI: InChI=1/C15H17Cl2N3O2/c1-2-3-12-7-21-15(22-12,8-20-10-18-9-19-20)13-5-4-11(16)6-14(13)17/h4-6,9-10,12H,2-3,7-8H2,1H3
39 atoms
Cl 0.857168 0.014141 -3.005042
Cl 1.993406 -4.230231 0.0024
O  -1.28595 1.507886 0.670297
O  -1.253276 1.475042 -1.556295
N  1.544881 2.18288 0.663907
N  2.71148 1.54702 0.517766
N  2.378335 2.085632 2.668271
C  -0.453467 1.281149 -0.436425
C  -2.640924 1.305645 0.282619
C  -2.524193 0.979696 -1.211438
C  -3.313421 0.220547 1.101852
C  0.648264 2.34584 -0.446867
C  0.13997 -0.12497 -0.369106
C  -4.792339 0.073607 0.760155
C  0.74625 -0.748614 -1.457535
C  0.155466 -0.806875 0.843472
C  -5.479989 -0.984858 1.609833
C  1.310555 -2.010746 -1.351215
C  0.7192 -2.062905 0.977702
C  1.358229 2.490248 1.956945
C  1.290141 -2.661396 -0.131037
C  3.176087 1.512683 1.741585
H  -3.174078 2.252711 0.430222
H  -2.592495 -0.102161 -1.388645
H  -3.271904 1.477895 -1.827517
H  -3.208233 0.455247 2.164939
H  -2.799426 -0.732358 0.939126
H  0.185298 3.333143 -0.409751
H  1.235893 2.275101 -1.359515
H  -4.909543 -0.182799 -0.297595
H  -5.296491 1.035515 0.894798
H  -0.278937 -0.338855 1.715005
H  -6.534703 -1.079143 1.353028
H  -5.0183 -1.96352 1.472277
H  -5.419289 -0.73958 2.671099
H  1.768808 -2.473456 -2.213412
H  0.718065 -2.564289 1.934989
H  0.481359 3.001176 2.321985
H  4.128762 1.064127 1.975018
totalener: -1817.01792491 hartree
nucrepener: 2195.31115421 hartree
electener: -4012.32907911 hartree
oneelecener: -6855.93368736 hartree
twoeener: 2843.60460825 hartree
kineticenergy: 1811.92083701 hartree
xcener: -128.815164238835 hartree
chargesum: 0.0000000
charge: -0.057945 -0.068469 -0.374913 -0.321287 0.108298 -0.303819 -0.327717 0.581936 0.154112 -0.018303 -0.186270 -0.097505 -0.132328 -0.095041 0.001207 -0.176365 -0.256079 -0.141639 -0.162190 0.034511 0.111915 0.060102 0.077544 0.081259 0.101871 0.075435 0.066416 0.111344 0.129514 0.062141 0.063333 0.144931 0.088446 0.077984 0.077257 0.110148 0.125361 0.143218 0.131587
qa: -0.0579 -0.0685 -0.3749 -0.3213 0.1083 -0.3038 -0.3277 0.5819 0.1541 -0.0183 -0.1863 -0.0975 -0.1323 -0.0950 0.0012 -0.1764 -0.2561 -0.1416 -0.1622 0.0345 0.1119 0.0601 0.0775 0.0813 0.1019 0.0754 0.0664 0.1113 0.1295 0.0621 0.0633 0.1449 0.0884 0.0780 0.0773 0.1101 0.1254 0.1432 0.1316
va: 1.2660 1.2370 2.0040 2.0522 3.3226 2.8535 3.0637 3.8486 3.9143 3.9670 3.9496 3.8510 3.5480 3.8831 4.0291 3.8855 3.9535 4.0898 4.0978 4.0834 3.9275 4.0444 1.0041 0.9968 0.9893 1.0159 1.0070 1.0204 1.0308 1.0087 1.0095 1.0177 1.0053 1.0034 1.0034 1.0282 1.0126 1.0133 1.0019
dispcorr: -0.022709170 hartree
energy: -1817.040634078430
dipole: -35.83112 33.90671 -1.92441 10.38828 -10.19344 0.19484 14.15218 -14.32781 -0.17563
magnitude: 1.94220 au
magnitude: 4.93669 debye
