program: Orca
programVersion: 4.2.1
elementType: Cl Cl O O N N N C C C C C C C C C C C C C C C H H H H H H H H H H H H H H H H H
charge: 0
multiplicity: 1
keywords: wb97x-d3
keywords: def2-TZVPP
keywords: def2/J RIJCOSX GRIDX6 NOFINALGRIDX
keywords: grid4 nofinalgrid
keywords: scfconv7
keywords: smallprint printgap noloewdin
keywords: NOSOSCF
formula: C15H17Cl2N3O2
InChI: InChI=1/C15H17Cl2N3O2/c1-2-3-12-7-21-15(22-12,8-20-10-18-9-19-20)13-5-4-11(16)6-14(13)17/h4-6,9-10,12H,2-3,7-8H2,1H3
39 atoms
Cl -0.37171 -1.220838 2.115106
Cl 1.008638 -5.35809 -0.938858
O  -0.78293 0.998205 0.227845
O  0.515236 1.236587 -1.567202
N  1.48569 2.614955 0.698463
N  2.207441 3.443875 -0.06169
N  0.834702 4.604928 1.279163
C  0.447549 0.632878 -0.316884
C  -1.6777 1.35649 -0.816701
C  -0.798871 1.289483 -2.072505
C  -2.876975 0.428393 -0.869633
C  1.57999 1.191291 0.550663
C  0.576448 -0.886903 -0.432264
C  -3.711413 0.387501 0.407006
C  0.223171 -1.771074 0.58589
C  1.100911 -1.438176 -1.59772
C  -4.321778 1.727477 0.795758
C  0.353214 -3.143835 0.435888
C  1.24076 -2.803767 -1.771754
C  0.666287 3.325387 1.489168
C  0.855672 -3.652126 -0.748646
C  1.7867 4.62314 0.321004
H  -2.00186 2.385478 -0.630619
H  -1.031478 0.400061 -2.67282
H  -0.890353 2.169383 -2.708605
H  -2.532732 -0.581958 -1.11294
H  -3.507455 0.748018 -1.707639
H  2.5408 0.964462 0.091663
H  1.556535 0.719712 1.53295
H  -3.100018 0.00514 1.226614
H  -4.51181 -0.342381 0.263556
H  1.407861 -0.777283 -2.396546
H  -4.978255 1.620114 1.659048
H  -3.563269 2.464456 1.062285
H  -4.917898 2.146158 -0.017463
H  0.065367 -3.806488 1.239518
H  1.645318 -3.200677 -2.691954
H  -0.016424 2.872448 2.190428
H  2.185647 5.532792 -0.099737
totalener: -1817.01790084 hartree
nucrepener: 2186.61415498 hartree
electener: -4003.63205583 hartree
oneelecener: -6838.24745960 hartree
twoeener: 2834.61540378 hartree
kineticenergy: 1811.92226071 hartree
xcener: -128.816074840903 hartree
chargesum: 0.0000000
charge: -0.065107 -0.062648 -0.359624 -0.331216 0.113896 -0.299148 -0.337752 0.588979 0.161476 -0.034774 -0.205418 -0.128654 -0.151004 -0.088126 -0.035172 -0.125873 -0.269655 -0.144886 -0.166474 0.033186 0.106213 0.054268 0.101916 0.082889 0.098057 0.074294 0.082347 0.123020 0.139952 0.066121 0.068164 0.146391 0.089685 0.082603 0.076857 0.115228 0.126811 0.143534 0.129645
qa: -0.0651 -0.0626 -0.3596 -0.3312 0.1139 -0.2991 -0.3378 0.5890 0.1615 -0.0348 -0.2054 -0.1287 -0.1510 -0.0881 -0.0352 -0.1259 -0.2697 -0.1449 -0.1665 0.0332 0.1062 0.0543 0.1019 0.0829 0.0981 0.0743 0.0823 0.1230 0.1400 0.0661 0.0682 0.1464 0.0897 0.0826 0.0769 0.1152 0.1268 0.1435 0.1296
va: 1.2524 1.2431 1.9916 2.0400 3.3517 2.8810 3.0573 3.8462 3.8063 3.9803 3.9728 3.7990 3.5731 3.8727 4.0319 3.9328 3.9396 4.0787 4.0556 4.0799 3.9337 4.0596 0.9922 0.9953 1.0005 1.0079 1.0125 1.0278 1.0121 1.0255 1.0091 1.0232 1.0064 1.0004 1.0021 1.0270 1.0139 1.0103 1.0013
dispcorr: -0.022574467 hartree
energy: -1817.040475309303
dipole: -21.34669 20.62141 -0.72528 22.17598 -23.21165 -1.03567 -5.82278 5.14985 -0.67293
magnitude: 1.43230 au
magnitude: 3.64061 debye
