program: Orca
programVersion: 4.2.1
elementType: Cl Cl O O N N N C C C C C C C C C C C C C C C H H H H H H H H H H H H H H H H H
charge: 0
multiplicity: 1
keywords: wb97x-d3
keywords: def2-TZVPP
keywords: def2/J RIJCOSX GRIDX6 NOFINALGRIDX
keywords: grid4 nofinalgrid
keywords: scfconv7
keywords: smallprint printgap noloewdin
keywords: NOSOSCF
formula: C15H17Cl2N3O2
InChI: InChI=1/C15H17Cl2N3O2/c1-2-3-12-7-21-15(22-12,8-20-10-18-9-19-20)13-5-4-11(16)6-14(13)17/h4-6,9-10,12H,2-3,7-8H2,1H3
39 atoms
Cl -0.132462 -1.218379 2.105481
Cl 1.203345 -5.347099 -0.983222
O  -0.761145 0.927507 0.230373
O  0.425341 1.220958 -1.651342
N  1.419021 2.620272 0.649869
N  1.880412 3.567209 -0.172793
N  0.64224 4.481624 1.459756
C  0.450717 0.622003 -0.393836
C  -1.587902 1.67603 -0.651628
C  -0.924661 1.429111 -1.998511
C  -3.02361 1.209392 -0.551167
C  1.625609 1.224157 0.391206
C  0.619638 -0.890737 -0.506402
C  -3.631344 1.397213 0.833773
C  0.378436 -1.771424 0.546734
C  1.068692 -1.438533 -1.703641
C  -5.090697 0.970513 0.886312
C  0.55491 -3.139622 0.406208
C  1.251757 -2.800407 -1.869175
C  0.674448 3.183576 1.614245
C  0.987246 -3.646101 -0.806681
C  1.395847 4.664274 0.353033
H  -1.523749 2.740305 -0.385881
H  -1.351161 0.549869 -2.500203
H  -0.983705 2.281285 -2.674619
H  -3.082679 0.156074 -0.844248
H  -3.611746 1.770057 -1.286261
H  2.547709 1.111455 -0.177045
H  1.747273 0.701973 1.33977
H  -3.544323 2.446918 1.129615
H  -3.05395 0.824108 1.562154
H  1.27931 -0.779906 -2.534504
H  -5.509846 1.112081 1.882241
H  -5.700604 1.546548 0.188324
H  -5.204897 -0.083818 0.629434
H  0.356281 -3.800226 1.238006
H  1.597108 -3.195649 -2.813855
H  0.190586 2.614014 2.392252
H  1.597577 5.634971 -0.072069
totalener: -1817.01971746 hartree
nucrepener: 2171.15743194 hartree
electener: -3988.17714940 hartree
oneelecener: -6807.40905290 hartree
twoeener: 2819.23190350 hartree
kineticenergy: 1811.92107889 hartree
xcener: -128.813689581311 hartree
chargesum: 0.0000000
charge: -0.065098 -0.064381 -0.359428 -0.336165 0.119801 -0.299539 -0.332290 0.574650 0.142063 -0.013221 -0.165874 -0.146584 -0.089245 -0.063531 -0.058546 -0.114890 -0.263441 -0.147063 -0.164453 0.024727 0.105759 0.050630 0.082302 0.078083 0.100625 0.058011 0.067616 0.123292 0.139358 0.056690 0.066894 0.143102 0.087544 0.072763 0.075625 0.114796 0.125771 0.143080 0.130569
qa: -0.0651 -0.0644 -0.3594 -0.3362 0.1198 -0.2995 -0.3323 0.5746 0.1421 -0.0132 -0.1659 -0.1466 -0.0892 -0.0635 -0.0585 -0.1149 -0.2634 -0.1471 -0.1645 0.0247 0.1058 0.0506 0.0823 0.0781 0.1006 0.0580 0.0676 0.1233 0.1394 0.0567 0.0669 0.1431 0.0875 0.0728 0.0756 0.1148 0.1258 0.1431 0.1306
va: 1.2538 1.2412 2.0127 2.0382 3.3474 2.8814 3.0521 3.8397 3.8771 3.9905 3.9505 3.8266 3.6133 3.8618 4.0657 3.9176 3.9491 4.0746 4.0529 4.0767 3.9307 4.0511 0.9987 0.9984 1.0002 1.0183 1.0137 1.0291 1.0107 1.0111 1.0206 1.0250 1.0064 1.0025 1.0023 1.0264 1.0143 1.0112 1.0017
dispcorr: -0.021872895 hartree
energy: -1817.041590356558
dipole: -24.18347 23.59737 -0.58609 23.60122 -24.36339 -0.76217 -4.25482 3.61492 -0.63989
magnitude: 1.15493 au
magnitude: 2.93561 debye
