program: Orca
programVersion: 4.2.1
elementType: Cl Cl O O N N N C C C C C C C C C C C C C C C H H H H H H H H H H H H H H H H H
charge: 0
multiplicity: 1
keywords: wb97x-d3
keywords: def2-TZVPP
keywords: def2/J RIJCOSX GRIDX6 NOFINALGRIDX
keywords: grid4 nofinalgrid
keywords: scfconv7
keywords: smallprint printgap noloewdin
keywords: NOSOSCF
formula: C15H17Cl2N3O2
InChI: InChI=1/C15H17Cl2N3O2/c1-2-3-12-7-21-15(22-12,8-20-10-18-9-19-20)13-5-4-11(16)6-14(13)17/h4-6,9-10,12H,2-3,7-8H2,1H3
39 atoms
Cl 2.45205 -0.567975 -1.833595
Cl 0.70474 -5.400108 -0.440436
O  -1.000153 0.908828 0.671919
O  0.21278 1.249798 -1.181388
N  1.23742 2.596947 1.06293
N  0.618171 3.138031 2.116765
N  1.229409 4.733129 0.662791
C  0.215764 0.607503 0.056189
C  -1.856074 1.5826 -0.241565
C  -1.133963 1.386783 -1.568904
C  -3.256163 1.00681 -0.20375
C  1.35788 1.175322 0.909449
C  0.363215 -0.905749 -0.094557
C  -3.960698 1.176508 1.136258
C  1.324036 -1.500865 -0.911159
C  -0.473739 -1.754496 0.623841
C  -5.37194 0.60778 1.11928
C  1.431784 -2.879299 -1.022958
C  -0.382626 -3.132172 0.532674
C  1.588154 3.563942 0.200834
C  0.572908 -3.687354 -0.299968
C  0.639922 4.416954 1.836459
H  -1.884042 2.646182 0.028458
H  -1.492159 0.489845 -2.091708
H  -1.220813 2.239845 -2.240909
H  -3.216864 -0.053579 -0.475612
H  -3.843071 1.501911 -0.985632
H  2.321193 0.94134 0.457325
H  1.331461 0.724021 1.89973
H  -3.994242 2.238141 1.396978
H  -3.376404 0.692404 1.921771
H  -1.222238 -1.323734 1.273096
H  -5.863616 0.732511 2.083737
H  -5.991467 1.101116 0.368453
H  -5.36692 -0.458922 0.889023
H  2.180423 -3.313385 -1.670128
H  -1.049009 -3.764449 1.102038
H  2.097169 3.368029 -0.729562
H  0.222374 5.152639 2.505904
totalener: -1817.01960739 hartree
nucrepener: 2157.35360761 hartree
electener: -3974.37321500 hartree
oneelecener: -6779.77773136 hartree
twoeener: 2805.40451636 hartree
kineticenergy: 1811.92565489 hartree
xcener: -128.814834744218 hartree
chargesum: -0.0000000
charge: -0.058587 -0.063839 -0.357324 -0.343851 0.112028 -0.302566 -0.332447 0.564166 0.131665 0.022159 -0.194963 -0.127874 -0.119862 -0.067905 -0.012288 -0.135219 -0.260839 -0.156699 -0.160420 0.035537 0.109457 0.048534 0.077361 0.074256 0.102466 0.059677 0.077280 0.136107 0.122134 0.058735 0.071634 0.143720 0.088995 0.073467 0.073468 0.113797 0.124346 0.143370 0.130322
qa: -0.0586 -0.0638 -0.3573 -0.3439 0.1120 -0.3026 -0.3324 0.5642 0.1317 0.0222 -0.1950 -0.1279 -0.1199 -0.0679 -0.0123 -0.1352 -0.2608 -0.1567 -0.1604 0.0355 0.1095 0.0485 0.0774 0.0743 0.1025 0.0597 0.0773 0.1361 0.1221 0.0587 0.0716 0.1437 0.0890 0.0735 0.0735 0.1138 0.1243 0.1434 0.1303
va: 1.2632 1.2416 2.0220 2.0064 3.3624 2.8728 3.0587 3.8827 3.9251 3.9457 3.9572 3.8125 3.5821 3.8612 4.0217 3.9575 3.9433 4.0866 4.0554 4.0829 3.9231 4.0538 0.9988 1.0075 0.9975 1.0139 1.0146 1.0183 1.0255 1.0120 1.0173 1.0183 1.0062 1.0028 1.0025 1.0281 1.0145 1.0112 1.0018
dispcorr: -0.021592885 hartree
energy: -1817.041200271678
dipole: -32.89844 32.06598 -0.83246 20.11504 -20.93773 -0.82269 8.61098 -9.02293 -0.41195
magnitude: 1.24077 au
magnitude: 3.15379 debye
