program: Orca
programVersion: 4.2.1
elementType: Cl Cl O O N N N C C C C C C C C C C C C C C C H H H H H H H H H H H H H H H H H
charge: 0
multiplicity: 1
keywords: wb97x-d3
keywords: def2-TZVPP
keywords: def2/J RIJCOSX GRIDX6 NOFINALGRIDX
keywords: grid4 nofinalgrid
keywords: scfconv7
keywords: smallprint printgap noloewdin
keywords: NOSOSCF
formula: C15H17Cl2N3O2
InChI: InChI=1/C15H17Cl2N3O2/c1-2-3-12-7-21-15(22-12,8-20-10-18-9-19-20)13-5-4-11(16)6-14(13)17/h4-6,9-10,12H,2-3,7-8H2,1H3
39 atoms
Cl -0.624019 -0.600319 2.567282
Cl 1.882932 -4.150993 -0.507959
O  -1.740478 1.404446 0.734988
O  -0.694553 1.944725 -1.147778
N  1.790603 2.233883 0.361948
N  2.730058 1.441662 0.88726
N  3.510473 2.472832 -0.944091
C  -0.496218 1.371606 0.112002
C  -2.751825 1.324047 -0.257144
C  -1.975552 1.529009 -1.570773
C  -3.514627 0.012847 -0.192161
C  0.460746 2.267241 0.904564
C  0.05974 -0.044952 -0.021279
C  -4.693644 -0.016807 -1.158635
C  0.05014 -0.970696 1.019628
C  0.68034 -0.42668 -1.206539
C  -5.491364 -1.309056 -1.062104
C  0.602621 -2.233906 0.873925
C  1.243847 -1.678807 -1.374874
C  2.271698 2.836638 -0.736396
C  1.193976 -2.580831 -0.327315
C  3.742183 1.617904 0.0750
H  -3.446009 2.153467 -0.080417
H  -1.919066 0.597538 -2.148612
H  -2.398148 2.304196 -2.209629
H  -3.875472 -0.135725 0.828945
H  -2.834895 -0.818566 -0.405386
H  0.515562 1.934889 1.938831
H  0.079394 3.28946 0.88984
H  -4.342348 0.11216 -2.187561
H  -5.351742 0.834106 -0.956747
H  0.735895 0.278627 -2.023957
H  -5.893502 -1.449247 -0.057864
H  -6.33061 -1.312769 -1.757195
H  -4.869694 -2.175889 -1.289837
H  0.578882 -2.933505 1.697086
H  1.721797 -1.943441 -2.307229
H  1.691745 3.519939 -1.336641
H  4.685057 1.116194 0.2250
totalener: -1817.01777001 hartree
nucrepener: 2204.30669815 hartree
electener: -4021.32446816 hartree
oneelecener: -6873.95161618 hartree
twoeener: 2852.62714802 hartree
kineticenergy: 1811.91979325 hartree
xcener: -128.814912394897 hartree
chargesum: 0.0000000
charge: -0.058720 -0.067945 -0.338238 -0.356500 0.105698 -0.302060 -0.327877 0.589387 0.210115 -0.077627 -0.192362 -0.096246 -0.189136 -0.094711 0.007089 -0.129770 -0.255608 -0.134207 -0.176779 0.035373 0.114479 0.060224 0.084686 0.086292 0.105459 0.077220 0.063901 0.131463 0.111710 0.057812 0.062265 0.139986 0.077880 0.087648 0.077773 0.109879 0.125506 0.144508 0.131431
qa: -0.0587 -0.0679 -0.3382 -0.3565 0.1057 -0.3021 -0.3279 0.5894 0.2101 -0.0776 -0.1924 -0.0962 -0.1891 -0.0947 0.0071 -0.1298 -0.2556 -0.1342 -0.1768 0.0354 0.1145 0.0602 0.0847 0.0863 0.1055 0.0772 0.0639 0.1315 0.1117 0.0578 0.0623 0.1400 0.0779 0.0876 0.0778 0.1099 0.1255 0.1445 0.1314
va: 1.2625 1.2374 2.0530 2.0051 3.3279 2.8538 3.0637 3.8356 3.8674 3.9870 3.9692 3.8399 3.5668 3.8809 4.0064 3.8830 3.9538 4.0932 4.1042 4.0799 3.9237 4.0443 1.0010 0.9919 0.9946 1.0212 1.0062 1.0286 1.0237 1.0093 1.0093 1.0202 1.0037 1.0047 1.0037 1.0285 1.0131 1.0117 1.0019
dispcorr: -0.022996116 hartree
energy: -1817.040766130174
dipole: -30.34723 28.57000 -1.77723 11.61437 -11.32155 0.29282 -13.26979 12.69528 -0.57451
magnitude: 1.89059 au
magnitude: 4.80551 debye
