program: Orca
programVersion: 4.2.1
elementType: Cl Cl O O N N N C C C C C C C C C C C C C C C H H H H H H H H H H H H H H H H H
charge: 0
multiplicity: 1
keywords: wb97x-d3
keywords: def2-TZVPP
keywords: def2/J RIJCOSX GRIDX6 NOFINALGRIDX
keywords: grid4 nofinalgrid
keywords: scfconv7
keywords: smallprint printgap noloewdin
keywords: NOSOSCF
formula: C15H17Cl2N3O2
InChI: InChI=1/C15H17Cl2N3O2/c1-2-3-12-7-21-15(22-12,8-20-10-18-9-19-20)13-5-4-11(16)6-14(13)17/h4-6,9-10,12H,2-3,7-8H2,1H3
39 atoms
Cl -0.854412 -0.815422 2.327114
Cl 2.026406 -4.206853 -0.597249
O  -1.875993 1.195623 0.418442
O  -0.592733 1.811443 -1.32411
N  1.634506 2.19318 0.555051
N  2.07232 3.083029 -0.340691
N  3.753654 1.76118 0.336438
C  -0.561171 1.229179 -0.053567
C  -2.757061 1.42975 -0.669753
C  -1.891589 2.306052 -1.564904
C  -3.219125 0.142934 -1.339987
C  0.24708 2.111871 0.916942
C  0.05692 -0.160059 -0.1712
C  -3.840787 -0.878211 -0.392444
C  -0.023733 -1.117524 0.837288
C  0.792952 -0.492711 -1.305218
C  -5.079838 -0.375768 0.335986
C  0.572077 -2.364091 0.710591
C  1.404483 -1.724737 -1.450652
C  2.651611 1.407989 0.943693
C  1.282894 -2.660142 -0.438115
C  3.345223 2.789474 -0.437461
H  -3.613658 1.980401 -0.273512
H  -2.115847 2.203121 -2.62773
H  -1.968219 3.365795 -1.295372
H  -2.380277 -0.318102 -1.870247
H  -3.950302 0.418979 -2.107871
H  0.17004 1.716863 1.92937
H  -0.167114 3.11989 0.916902
H  -3.09594 -1.205805 0.334573
H  -4.100816 -1.764315 -0.97595
H  0.896324 0.234666 -2.097004
H  -4.847072 0.430576 1.032661
H  -5.832722 -0.004853 -0.362972
H  -5.540676 -1.174271 0.917238
H  0.48218 -3.091214 1.504978
H  1.973366 -1.949982 -2.341353
H  2.539846 0.608882 1.661009
H  4.007372 3.341563 -1.085887
totalener: -1817.01528384 hartree
nucrepener: 2223.67435386 hartree
electener: -4040.68963770 hartree
oneelecener: -6912.59553004 hartree
twoeener: 2871.90589234 hartree
kineticenergy: 1811.91519893 hartree
xcener: -128.815802531292 hartree
chargesum: 0.0000000
charge: -0.062365 -0.063943 -0.342320 -0.341654 0.117938 -0.296543 -0.325524 0.526377 0.155494 -0.000573 -0.208656 -0.141733 -0.107220 -0.095518 -0.060808 -0.121421 -0.270151 -0.116114 -0.127233 0.029710 0.096835 0.056314 0.101740 0.082650 0.081344 0.088230 0.078342 0.133234 0.103724 0.063784 0.070454 0.134900 0.083500 0.076700 0.089862 0.112492 0.125994 0.142124 0.130032
qa: -0.0624 -0.0639 -0.3423 -0.3417 0.1179 -0.2965 -0.3255 0.5264 0.1555 -0.0006 -0.2087 -0.1417 -0.1072 -0.0955 -0.0608 -0.1214 -0.2702 -0.1161 -0.1272 0.0297 0.0968 0.0563 0.1017 0.0826 0.0813 0.0882 0.0783 0.1332 0.1037 0.0638 0.0705 0.1349 0.0835 0.0767 0.0899 0.1125 0.1260 0.1421 0.1300
va: 1.2562 1.2411 2.0312 2.0126 3.3159 2.8831 3.0647 3.9239 3.8634 4.0439 3.9376 3.9182 3.5229 3.8831 3.9722 3.8945 3.9360 4.0634 4.0386 4.0897 3.9404 4.0539 0.9882 0.9920 0.9968 1.0064 1.0121 1.0150 1.0271 1.0273 1.0115 1.0334 1.0006 1.0013 1.0074 1.0274 1.0115 1.0003 1.0018
dispcorr: -0.023986651 hartree
energy: -1817.039270489508
dipole: -27.19410 25.59425 -1.59986 14.38917 -14.32472 0.06445 -8.60871 8.29645 -0.31226
magnitude: 1.63132 au
magnitude: 4.14649 debye
