program: Orca
programVersion: 4.2.1
elementType: Cl Cl O O N N N C C C C C C C C C C C C C C C H H H H H H H H H H H H H H H H H
charge: 0
multiplicity: 1
keywords: wb97x-d3
keywords: def2-TZVPP
keywords: def2/J RIJCOSX GRIDX6 NOFINALGRIDX
keywords: grid4 nofinalgrid
keywords: scfconv7
keywords: smallprint printgap noloewdin
keywords: NOSOSCF
formula: C15H17Cl2N3O2
InChI: InChI=1/C15H17Cl2N3O2/c1-2-3-12-7-21-15(22-12,8-20-10-18-9-19-20)13-5-4-11(16)6-14(13)17/h4-6,9-10,12H,2-3,7-8H2,1H3
39 atoms
Cl -0.058641 -1.00808 2.291549
Cl 0.338637 -5.311739 -0.814927
O  -0.731927 1.201589 0.335107
O  0.410997 1.252336 -1.600301
N  1.685242 2.617321 0.579037
N  2.305384 3.404847 -0.305293
N  1.239044 4.641772 1.23325
C  0.406854 0.714075 -0.312959
C  -1.59435 1.810849 -0.617573
C  -0.604609 2.226972 -1.700671
C  -2.697327 0.888859 -1.122609
C  1.664416 1.188428 0.437764
C  0.393743 -0.80903 -0.405007
C  -3.812145 0.581666 -0.125984
C  0.183247 -1.637621 0.696359
C  0.608554 -1.428975 -1.632488
C  -3.415939 -0.289614 1.057118
C  0.16172 -3.019208 0.576739
C  0.597258 -2.805177 -1.77624
C  1.047863 3.372992 1.486586
C  0.366782 -3.595079 -0.664096
C  2.013876 4.606963 0.127454
H  -2.04129 2.6839 -0.13231
H  -1.026669 2.190802 -2.706321
H  -0.203288 3.230856 -1.529774
H  -2.262601 -0.041975 -1.501834
H  -3.149907 1.384828 -1.987546
H  2.5507 0.889616 -0.119513
H  1.718079 0.736289 1.42631
H  -4.618012 0.086789 -0.674011
H  -4.237526 1.523603 0.23539
H  0.78457 -0.817154 -2.504965
H  -4.294513 -0.558702 1.644164
H  -2.947033 -1.216827 0.723597
H  -2.715005 0.208528 1.722364
H  -0.01261 -3.635731 1.446896
H  0.764532 -3.254964 -2.744587
H  0.472746 2.956965 2.29884
H  2.380913 5.492803 -0.366842
totalener: -1817.01615559 hartree
nucrepener: 2209.66904399 hartree
electener: -4026.68519959 hartree
oneelecener: -6884.41513332 hartree
twoeener: 2857.72993373 hartree
kineticenergy: 1811.91236787 hartree
xcener: -128.815776495819 hartree
chargesum: -0.0000000
charge: -0.069008 -0.063716 -0.362555 -0.356766 0.110855 -0.308209 -0.326829 0.566710 0.180282 -0.008581 -0.188925 -0.149451 -0.089947 -0.089248 -0.052946 -0.131707 -0.263469 -0.138254 -0.146363 0.029934 0.104360 0.048163 0.091986 0.079495 0.091439 0.082816 0.074825 0.121988 0.140712 0.069712 0.049500 0.138648 0.092860 0.072081 0.081493 0.114916 0.126201 0.145589 0.131409
qa: -0.0690 -0.0637 -0.3626 -0.3568 0.1109 -0.3082 -0.3268 0.5667 0.1803 -0.0086 -0.1889 -0.1495 -0.0899 -0.0892 -0.0529 -0.1317 -0.2635 -0.1383 -0.1464 0.0299 0.1044 0.0482 0.0920 0.0795 0.0914 0.0828 0.0748 0.1220 0.1407 0.0697 0.0495 0.1386 0.0929 0.0721 0.0815 0.1149 0.1262 0.1456 0.1314
va: 1.2480 1.2421 2.0015 2.0195 3.3503 2.8486 3.0535 3.8505 3.8093 4.0206 3.9302 3.8100 3.5064 3.9024 3.9980 3.9429 3.9524 4.0724 4.0356 4.0787 3.9382 4.0441 0.9980 1.0013 0.9937 1.0051 1.0145 1.0285 1.0203 1.0067 1.0089 1.0311 1.0087 0.9999 1.0109 1.0268 1.0132 1.0097 1.0021
dispcorr: -0.024117758 hartree
energy: -1817.040273348370
dipole: -18.13474 17.41318 -0.72156 19.77313 -20.38811 -0.61498 -6.49317 5.94158 -0.55160
magnitude: 1.09686 au
magnitude: 2.78801 debye
