program: Orca
programVersion: 4.2.1
elementType: Cl Cl O O N N N C C C C C C C C C C C C C C C H H H H H H H H H H H H H H H H H
charge: 0
multiplicity: 1
keywords: wb97x-d3
keywords: def2-TZVPP
keywords: def2/J RIJCOSX GRIDX6 NOFINALGRIDX
keywords: grid4 nofinalgrid
keywords: scfconv7
keywords: smallprint printgap noloewdin
keywords: NOSOSCF
formula: C15H17Cl2N3O2
InChI: InChI=1/C15H17Cl2N3O2/c1-2-3-12-7-21-15(22-12,8-20-10-18-9-19-20)13-5-4-11(16)6-14(13)17/h4-6,9-10,12H,2-3,7-8H2,1H3
39 atoms
Cl -0.672502 -0.48411 2.444244
Cl 1.758358 -4.168598 -0.534121
O  -1.799971 1.450997 0.480599
O  -0.609871 1.941367 -1.361184
N  1.76805 2.182745 0.486344
N  2.296235 2.754519 -0.59895
N  3.828682 1.492453 0.44659
C  -0.516875 1.414556 -0.068143
C  -2.739294 1.55007 -0.578081
C  -1.940551 2.340159 -1.60738
C  -3.218527 0.194351 -1.07639
C  0.375772 2.311924 0.809647
C  0.04594 -0.002382 -0.154378
C  -3.875174 -0.657188 0.002431
C  0.00315 -0.905681 0.904708
C  0.675886 -0.423456 -1.322145
C  -4.319574 -2.013075 -0.52566
C  0.5207 -2.187631 0.794415
C  1.209254 -1.692893 -1.453625
C  2.695016 1.424668 1.092856
C  1.11749 -2.57498 -0.391542
C  3.531223 2.316721 -0.580398
H  -3.588941 2.122165 -0.194777
H  -2.201164 2.095762 -2.638855
H  -2.055995 3.420972 -1.469072
H  -2.387738 -0.357144 -1.528735
H  -3.936646 0.374014 -1.884148
H  0.244516 2.046274 1.857523
H  0.074326 3.351796 0.68311
H  -4.736594 -0.121862 0.413729
H  -3.181933 -0.7988 0.833194
H  0.752531 0.26303 -2.152403
H  -4.799758 -2.60479 0.253499
H  -5.031117 -1.911028 -1.346737
H  -3.469781 -2.587786 -0.897055
H  0.461567 -2.870748 1.629616
H  1.693539 -1.989791 -2.372929
H  2.496928 0.857918 1.990174
H  4.248244 2.607523 -1.332024
totalener: -1817.01561891 hartree
nucrepener: 2234.26053251 hartree
electener: -4051.27615142 hartree
oneelecener: -6933.82887309 hartree
twoeener: 2882.55272167 hartree
kineticenergy: 1811.92175645 hartree
xcener: -128.816166993928 hartree
chargesum: -0.0000000
charge: -0.066880 -0.065033 -0.337954 -0.340090 0.117480 -0.301827 -0.322897 0.536861 0.185265 0.002268 -0.222659 -0.135769 -0.080188 -0.089513 -0.089028 -0.143457 -0.259115 -0.107207 -0.121434 0.040033 0.093494 0.054634 0.093939 0.077204 0.078315 0.081010 0.076031 0.128748 0.103658 0.058700 0.073658 0.135381 0.087880 0.072957 0.078158 0.112401 0.126122 0.139200 0.129653
qa: -0.0669 -0.0650 -0.3380 -0.3401 0.1175 -0.3018 -0.3229 0.5369 0.1853 0.0023 -0.2227 -0.1358 -0.0802 -0.0895 -0.0890 -0.1435 -0.2591 -0.1072 -0.1214 0.0400 0.0935 0.0546 0.0939 0.0772 0.0783 0.0810 0.0760 0.1287 0.1037 0.0587 0.0737 0.1354 0.0879 0.0730 0.0782 0.1124 0.1261 0.1392 0.1297
va: 1.2492 1.2402 2.0441 2.0165 3.3181 2.8681 3.0655 3.8610 3.8969 4.0296 3.9368 3.9200 3.5289 3.8771 3.9686 3.9077 3.9506 4.0542 4.0315 4.0778 3.9460 4.0534 0.9933 0.9914 0.9946 1.0003 1.0152 1.0130 1.0244 1.0098 1.0245 1.0363 1.0059 1.0031 1.0032 1.0263 1.0111 1.0060 1.0021
dispcorr: -0.024137254 hartree
energy: -1817.039756163720
dipole: -25.59101 23.94167 -1.64934 10.12449 -9.89423 0.23025 -10.23434 9.97508 -0.25926
magnitude: 1.68540 au
magnitude: 4.28394 debye
