program: Orca
programVersion: 4.2.1
elementType: Cl Cl O O N N N C C C C C C C C C C C C C C C H H H H H H H H H H H H H H H H H
charge: 0
multiplicity: 1
keywords: wb97x-d3
keywords: def2-TZVPP
keywords: def2/J RIJCOSX GRIDX6 NOFINALGRIDX
keywords: grid4 nofinalgrid
keywords: scfconv7
keywords: smallprint printgap noloewdin
keywords: NOSOSCF
formula: C15H17Cl2N3O2
InChI: InChI=1/C15H17Cl2N3O2/c1-2-3-12-7-21-15(22-12,8-20-10-18-9-19-20)13-5-4-11(16)6-14(13)17/h4-6,9-10,12H,2-3,7-8H2,1H3
39 atoms
Cl 0.521559 -1.300539 2.345361
Cl 1.416362 -5.378205 -0.964373
O  -0.783364 0.708027 0.638752
O  -0.040864 1.088553 -1.446227
N  1.311803 2.644865 0.461462
N  0.927846 3.14547 1.639468
N  0.924769 4.7481 0.070031
C  0.297466 0.513054 -0.215258
C  -1.764638 1.523354 0.015368
C  -1.432947 1.326416 -1.458583
C  -3.140578 1.06648 0.467445
C  1.555924 1.240519 0.288259
C  0.577411 -0.977958 -0.368295
C  -4.267657 2.046656 0.157767
C  0.68467 -1.848677 0.715538
C  0.759355 -1.514566 -1.638486
C  -4.561048 2.258806 -1.321774
C  0.942023 -3.199886 0.53758
C  1.016174 -2.859774 -1.840585
C  1.296981 3.61529 -0.466132
C  1.101642 -3.697835 -0.743404
C  0.709229 4.406231 1.359051
H  -1.613989 2.572454 0.307065
H  -1.9785 0.473127 -1.881492
H  -1.623534 2.204538 -2.074097
H  -3.096646 0.920998 1.548776
H  -3.359518 0.085718 0.033194
H  2.363095 1.099659 -0.432422
H  1.880511 0.835693 1.243965
H  -4.049103 3.009572 0.628172
H  -5.172794 1.678455 0.645918
H  0.693446 -0.863072 -2.498087
H  -5.457621 2.863983 -1.456857
H  -3.75254 2.779909 -1.835197
H  -4.727378 1.311148 -1.837035
H  1.015681 -3.854029 1.394592
H  1.146686 -3.248501 -2.840576
H  1.566818 3.45038 -1.497311
H  0.391835 5.109033 2.113335
totalener: -1817.01678659 hartree
nucrepener: 2163.60045305 hartree
electener: -3980.61723964 hartree
oneelecener: -6792.39716825 hartree
twoeener: 2811.77992860 hartree
kineticenergy: 1811.91537918 hartree
xcener: -128.813640671842 hartree
chargesum: -0.0000000
charge: -0.047592 -0.066051 -0.331252 -0.382298 0.103624 -0.294105 -0.326606 0.562708 0.139355 -0.023212 -0.145669 -0.136248 -0.081127 -0.114057 -0.049773 -0.117815 -0.268237 -0.150074 -0.166174 0.026179 0.107390 0.045063 0.072300 0.092208 0.101907 0.088661 0.065576 0.123451 0.136036 0.060777 0.073806 0.137672 0.096224 0.074761 0.080278 0.114165 0.124464 0.143474 0.130209
qa: -0.0476 -0.0661 -0.3313 -0.3823 0.1036 -0.2941 -0.3266 0.5627 0.1394 -0.0232 -0.1457 -0.1362 -0.0811 -0.1141 -0.0498 -0.1178 -0.2682 -0.1501 -0.1662 0.0262 0.1074 0.0451 0.0723 0.0922 0.1019 0.0887 0.0656 0.1235 0.1360 0.0608 0.0738 0.1377 0.0962 0.0748 0.0803 0.1142 0.1245 0.1435 0.1302
va: 1.2739 1.2395 2.0560 1.9935 3.3621 2.8586 3.0541 3.8569 3.8918 3.9426 3.9364 3.8240 3.6257 3.9002 4.0952 3.9140 3.9208 4.0728 4.0583 4.0813 3.9288 4.0464 0.9903 0.9990 1.0032 1.0190 1.0148 1.0079 1.0327 1.0103 1.0081 1.0272 1.0073 1.0057 1.0038 1.0279 1.0145 1.0102 1.0028
dispcorr: -0.021865730 hartree
energy: -1817.038652317312
dipole: -26.74029 26.17387 -0.56642 27.94319 -28.43891 -0.49571 -9.91606 8.96835 -0.94771
magnitude: 1.21026 au
magnitude: 3.07623 debye
